program: Gaussian 09
title: 000266025
version: EM64L-G09RevD.01
frameworkgroup: C1[X(C8H8N2O4S)]
method: RPBEPBE
basis: SDD
operation: Freq
keyword: #p
keyword: freq=noraman
keyword: PBEPBE/SDD
title: #p freq=noraman PBEPBE/SDD
converged: YES YES NO NO
title: Mulliken charges:
elementType: S O O O O N N C C C C C C C C H H H H H H H H
charge: 0.286546 -0.419017 -0.209372 -0.210633 -0.208697 0.008266 0.033490 -0.446308 -0.679698 -0.272478 -0.133446 0.276415 0.350567 -0.244129 -0.422539 0.321540 0.237844 0.242309 0.252557 0.258403 0.297392 0.297113 0.383874
chargesum: 0.00000
title: Mulliken charges with hydrogens summed into heavy atoms:
elementType: S O O O O N N C C C C C C C C
charge: 0.286546 -0.035143 -0.209372 -0.210633 -0.208697 0.008266 0.033490 -0.124768 0.053012 -0.272478 0.124957 0.276415 0.350567 0.053264 -0.125426
polarizability: 2.31179431e+02 1.30181589e+01 1.33591428e+02 1.15918587e+01 -1.38694701e+01 7.59540768e+01
1716.lowfreq: -3.9136 -0.0017 -0.0006 0.0005 3.6465 9.1795 20.1532 35.8116 48.7229
frequency: 20.1338 35.8078 48.7196 72.8633 84.1862 88.9765 169.6350 218.9562 222.7010 247.1506 260.3701 275.3947 294.7555 372.9731 409.5116 412.9602 469.0198 503.7158 519.5891 558.0754 588.9530 617.7580 671.9708 674.5608 704.1795 706.8774 747.5809 794.0622 810.7180 841.2004 952.4599 978.7704 993.1272 994.2763 1022.6001 1067.2841 1086.4817 1098.7353 1119.9495 1136.1168 1216.5836 1232.8993 1238.5760 1265.1801 1320.3587 1330.1133 1347.4587 1378.8858 1394.5008 1430.0167 1472.8545 1480.0252 1549.3551 1570.8158 1677.6685 2999.2182 3080.0277 3104.9443 3106.6187 3163.2400 3173.7887 3188.8937 3520.2145
redmass: 6.1783 8.4568 11.5899 6.0197 5.7528 7.2850 8.8585 2.2232 2.3096 2.2365 7.4663 4.0371 6.4485 6.7408 4.8956 5.0075 3.6336 7.7810 9.9963 3.3262 1.4281 8.3064 4.0401 7.0915 3.7467 8.9534 5.1620 9.8703 3.2044 1.4208 1.4463 3.4535 1.6014 1.3911 2.7349 2.8730 2.9385 1.6436 2.8554 1.5979 7.0785 1.2855 1.3810 1.5541 1.9282 4.1960 4.7233 7.4444 1.1913 2.2255 1.0432 1.0514 7.6711 6.3891 9.2475 1.0347 1.0870 1.0989 1.1007 1.0911 1.0929 1.0972 1.0642
irintensity: 1.3189 0.5885 0.8167 2.6512 0.7725 2.6901 2.3486 0.8528 1.8279 1.2600 2.4588 1.0774 0.4292 0.3473 9.7537 10.9973 5.0652 9.3738 17.4071 29.4408 136.2970 0.3295 16.0853 9.7196 41.5677 2.4144 7.9435 33.3017 2.7215 33.4013 8.7711 5.7070 20.3138 8.3234 310.0596 16.2091 98.6133 16.3926 66.4132 11.6602 560.4987 2.7860 1.0372 2.1266 21.2548 6.8635 33.9828 108.7266 16.7116 33.4551 18.2489 13.5868 22.1290 257.9418 179.5547 18.4177 1.3170 12.0596 11.0425 1.1465 1.0202 2.5760 28.8529
temp: 298.150 k
press: 1.00000 atm
elementType: 16 8 8 8 8 7 7 6 6 6 6 6 6 6 6 1 1 1 1 1 1 1 1
symmnumber: 1
zpe: 413521.5 jmol-1
zpe.correction: 0.157502 hartree
zpe.thermalcorrener: 0.172103 hartree
zpe.thermalcorrenthalpy: 0.173047 hartree
zpe.thermalcorrgfe: 0.113268 hartree
zpe.sumelectzpe: -1116.921592 hartree
zpe.sumelectthermal: -1116.906992 hartree
zpe.sumelectthermalent: -1116.906047 hartree
zpe.sumelectthermalfe: -1116.965826 hartree
dipole: -4.7889 -1.5965 -1.1603
dipole: 5.1796
quadrupole: -107.6457 -85.7093 -97.6720
quadrupole: -10.3636 4.5934 1.3753
quadrupole: -10.6367 11.2996 -0.6630 -10.3636 4.5934 1.3753
hfenergy: -1117.0790944 hartree
pointgroup: C01 [X(C8H8N2O4S1)]
dipole: -1.9089358 0.5676561 0.4317756 debye
dipolederiv: -0.9988304 0.0416418 0.0367283 0.2035789 -0.0000216 -0.0325691 0.1057175 -0.0274227 -0.0285413 -0.4984681 -0.2026446 0.0630375 -0.4951494 -1.0707178 0.3443305 0.0172306 0.2098386 -0.376593 -0.3776596 -0.1158619 0.1009062 -0.1831488 -0.5440746 -0.0915849 0.0992384 0.1008734 -0.8815225 -1.0160879 -0.1135949 0.0855604 -0.2639123 -0.4907878 0.0978824 0.1393188 0.0890226 -0.2731851 -0.6473529 0.1575404 -0.0226524 0.4093536 -0.7654987 0.1464736 -0.0971621 0.1583189 -0.2721991 -0.8631251 0.1302079 -0.0139308 0.7254112 -0.5076099 0.0639903 -0.1894756 0.0789498 -0.2077387 2.1723856 -0.2352016 -0.0570617 -0.4058386 1.077137 -0.2545756 -0.0223888 -0.2575736 0.2837127 0.4119569 0.2702816 0.0439579 0.4376809 0.0611692 -0.0912512 -0.1734677 -0.1895124 -0.0471319 -0.0209623 -0.0552057 -0.0249225 -0.2016073 -0.0096423 -0.0119213 0.0589382 -0.0317104 0.0401711 1.6216161 -0.238681 -0.0072675 -0.5398218 0.1940951 -0.0373363 0.0470593 -0.0250435 0.0216945 -0.920671 0.0366534 0.0326271 -0.1605753 0.0906221 -0.0456068 0.1037231 -0.0701636 -0.0781284 0.3046825 0.2442691 -0.2281242 0.5440233 1.3179569 -0.0899061 -0.0664955 -0.0030536 1.1412232 -1.0622986 0.1380377 0.0218961 0.4161098 -0.2213452 0.0657109 -0.031846 0.0814375 0.0355118 0.4182224 -0.0317386 -0.0226226 -0.4973117 0.157435 -0.0410593 0.1167136 -0.0661979 -0.0449978 0.6841251 -0.0507592 -0.0280142 -0.0345268 0.1920282 -0.0719781 -0.0402879 -0.0537412 0.0293601 0.0109449 -0.004504 -0.0430319 -0.0714832 0.0015076 0.0490379 -0.0299397 0.014484 0.0270286 0.0609102 0.0189245 -0.0278751 0.0872866 0.0815822 0.0498925 -0.1009846 0.07035 -0.0472961 0.1099946 0.0128799 0.0093144 0.0578999 0.0016455 -0.1270807 -0.0055116 -0.1067928 -0.0104116 -0.0270272 -0.0655115 0.0236819 -0.0970942 -0.0085346 0.0601712 0.0405386 0.0454086 0.1092308 0.0843394 0.0580404 -0.0111926 0.0345709 -0.0007684 0.0474225 -0.00525 0.048304 0.1419599 0.078168 -0.0619346 0.0260643 -0.0045161 0.1110654 0.0189824 0.0111455 0.0211529 0.1583836 0.0926725 0.0272593 -0.0046494 0.0296186 0.0497956 0.029154 -0.0150074 0.0248184 0.1312978 0.3824648 0.0399013 0.0475708 0.0094518 0.2829612 -0.078179 0.0381934 -0.1117469 0.1481713 unknown
polarizability: 232.1695433|-9.6647536|132.7517128|-9.2279679|-14.5429519|75.8036802 unknown
InChI: InChI=1S/C8H8N2O4S/c1-5(8(11)12)15-7-3-2-6(4-9-7)10(13)14/h2-5,11H,1H3
charge 0 multiplicity 1
23 atoms
S  -2.041181 1.57741 -0.039887
O  -3.200192 -2.313091 -0.014683
O  -2.509911 -0.970428 -1.781359
O  4.615988 0.4466 -0.22316
O  3.853858 -1.592281 0.477741
N  -0.0771 -0.283552 0.389121
N  3.666724 -0.367607 0.107775
C  -2.948561 0.002488 0.483351
C  -4.423471 0.367911 0.759562
C  -0.323756 0.999361 -0.00075
C  0.70295 1.911941 -0.375822
C  -2.82887 -1.08668 -0.583785
C  2.284158 0.135619 0.061448
C  2.03264 1.469839 -0.344242
C  1.211747 -0.710961 0.420026
H  -2.452008 -0.366274 1.394055
H  -4.919664 0.76382 -0.14351
H  -4.488668 1.124913 1.559304
H  -4.963209 -0.53642 1.088098
H  0.456768 2.9313 -0.686044
H  2.867071 2.118449 -0.622702
H  1.397276 -1.741332 0.735039
H  -3.140886 -3.027325 -0.705373
