program: Gaussian 09
title: 000266041
version: EM64L-G09RevD.01
frameworkgroup: C1[X(C17H15NO3)]
method: RPBEPBE
basis: SDD
operation: Freq
keyword: #p
keyword: freq=noraman
keyword: PBEPBE/SDD
title: #p freq=noraman PBEPBE/SDD
converged: YES YES NO NO
title: Mulliken charges:
elementType: O O O N C C C C C C C C C C C C C C C C C H H H H H H H H H H H H H H H
charge: -0.280709 -0.286226 -0.210700 0.039962 0.237624 0.192445 0.194005 0.100979 -0.245052 -0.281927 -0.093801 -0.699601 -0.722566 0.234947 -0.388467 0.079261 -0.322146 -0.110426 -0.341871 -0.193580 -0.524034 0.227810 0.275662 0.214918 0.241942 0.228815 0.238664 0.202911 0.233115 0.259232 0.271031 0.255717 0.265304 0.228802 0.241469 0.236490
chargesum: 0.00000
title: Mulliken charges with hydrogens summed into heavy atoms:
elementType: O O O N C C C C C C C C C C C C C C C C C
charge: -0.280709 -0.286226 -0.210700 0.039962 0.237624 0.192445 0.194005 0.100979 -0.017242 -0.006265 -0.093801 -0.013926 -0.047876 0.234947 -0.129235 0.079261 -0.051115 -0.110426 -0.086154 0.071724 0.182727
polarizability: 3.45705892e+02 4.72253866e+00 2.15744695e+02 -2.92088452e+00 -3.53912226e+00 1.02176502e+02
1716.lowfreq: -8.1008 -0.0008 -0.0005 0.0005 2.5493 5.8936 34.4668 44.2022 76.7101
frequency: 34.4168 44.1734 76.7083 90.1088 140.3693 147.8754 179.0223 190.5027 223.0917 226.9076 242.5396 259.7685 263.1696 282.9083 293.7913 312.5133 340.7040 358.2612 386.7224 403.6350 424.3736 463.8100 473.9717 503.6373 520.8483 540.8529 545.1255 579.1632 591.6406 629.7814 649.6415 659.7309 698.9025 713.2807 731.6828 756.3750 787.1722 792.1926 794.8771 823.0688 838.5584 853.1799 859.0558 890.6317 909.5030 920.1598 945.9635 961.9616 971.7706 978.1489 996.1178 1015.0640 1047.2869 1075.5389 1111.2069 1114.0126 1139.9824 1146.3695 1156.7807 1173.7571 1194.0057 1226.0273 1237.4681 1244.2164 1254.2419 1297.2021 1312.3552 1324.0762 1369.1085 1373.2877 1377.7190 1391.9376 1405.4350 1433.9524 1445.4452 1451.2182 1459.6293 1468.6331 1471.6974 1478.7323 1482.5555 1511.0355 1528.1348 1555.2947 1591.8811 1609.6644 1634.3863 2981.6951 2983.6391 2994.4241 3082.8700 3083.3876 3092.3633 3094.4406 3105.0355 3127.2902 3131.9787 3159.3410 3181.9590 3208.1310 3238.2771 3266.6353
redmass: 4.1258 3.2224 4.1022 5.0034 3.9965 4.0050 4.6216 1.0444 2.5391 4.9744 1.2480 3.5268 4.0027 1.2606 3.3705 3.1946 3.3982 4.3834 4.6626 5.3825 3.8477 3.7964 4.7337 5.5004 7.0665 4.1062 5.0769 4.4977 6.9079 4.9293 5.0135 6.1178 5.5426 2.6257 1.4610 2.4932 4.8389 6.5118 5.1248 5.8551 1.6536 1.3522 5.2087 3.4873 6.4325 1.5399 1.7974 1.4187 1.3261 3.8318 1.3157 3.9732 3.6041 3.5423 1.2537 1.6211 1.4400 1.4684 1.8034 1.8136 2.8429 1.7948 2.6105 2.4011 5.8245 2.9747 5.3707 2.3705 2.4012 1.4657 3.3026 1.3546 2.7924 2.1346 1.8224 1.0653 1.0498 1.0889 1.0531 1.0489 1.0588 5.5631 5.8312 8.5136 9.2730 9.0316 7.5782 1.0309 1.0346 1.0355 1.0995 1.1053 1.1009 1.0993 1.1007 1.1015 1.0903 1.0879 1.0983 1.0939 1.0900 1.1081
irintensity: 0.0739 0.9060 1.7690 2.6401 8.0874 2.9599 0.4507 0.0516 0.9300 0.9931 0.8011 1.1314 4.2460 0.0728 0.3354 5.9445 0.7187 7.7118 1.0962 1.3330 1.4362 0.8327 2.0168 0.4260 1.9478 6.1366 6.6117 3.9214 3.8506 1.1234 3.1239 9.4245 17.3855 54.7505 6.1721 44.6753 1.2558 2.8507 1.4757 9.7575 46.7713 0.1315 3.5295 58.8960 20.7003 4.6831 3.7643 6.0487 0.0924 2.2975 0.1423 11.5247 98.7168 78.2038 3.6721 113.9331 5.5907 46.8248 51.6584 22.4476 82.6945 25.9477 12.3960 23.1401 45.4365 47.5464 53.4568 93.7831 19.8824 28.1415 48.9268 4.2036 48.7846 5.8914 24.6822 4.3190 2.2664 2.2684 15.5624 23.3382 15.3859 109.1437 0.5863 25.3485 15.1451 42.2759 40.6159 52.6294 16.7689 27.7625 8.3285 30.3382 24.8467 24.0286 29.0888 17.0309 8.7353 0.6286 7.0453 9.8941 6.0655 2.6393
temp: 298.150 k
press: 1.00000 atm
elementType: 8 8 8 7 6 6 6 6 6 6 6 6 6 6 6 6 6 6 6 6 6 1 1 1 1 1 1 1 1 1 1 1 1 1 1 1
symmnumber: 1
zpe: 730578.4 jmol-1
zpe.correction: 0.278263 hartree
zpe.thermalcorrener: 0.296002 hartree
zpe.thermalcorrenthalpy: 0.296946 hartree
zpe.thermalcorrgfe: 0.233322 hartree
zpe.sumelectzpe: -935.712800 hartree
zpe.sumelectthermal: -935.695061 hartree
zpe.sumelectthermalent: -935.694117 hartree
zpe.sumelectthermalfe: -935.757741 hartree
dipole: 0.3910 5.8671 0.6259
dipole: 5.9134
quadrupole: -106.1982 -112.8759 -125.2936
quadrupole: -14.1306 1.8812 -0.4580
quadrupole: 8.5911 1.9133 -10.5044 -14.1306 1.8812 -0.4580
hfenergy: -935.9910631 hartree
pointgroup: C01 [X(C17H15N1O3)]
dipole: -0.2902765 -2.2794699 0.3638264 debye
polarizability: 344.1513526|-1.0351889|215.5884675|20.5826084|-3.5040644|103.8872683 unknown
InChI: InChI=1S/C17H15NO3/c1-17(2)8-6-10-13(21-17)5-4-12-14(10)15(19-3)11-7-9-20-16(11)18-12/h4-9H,1-3H3
charge 0 multiplicity 1
36 atoms
O  -3.379956 1.046454 -0.49928
O  0.683408 -2.212225 0.155678
O  4.328275 0.939346 0.426809
N  2.131217 1.833443 0.147154
C  -4.074646 -0.241066 -0.10295
C  -1.168605 -0.025843 -0.253028
C  0.258909 0.158356 -0.054803
C  -1.996405 1.125106 -0.312358
C  -3.200713 -1.408265 -0.525361
C  -1.840252 -1.305775 -0.534228
C  0.786705 1.52199 -0.015139
C  -4.28015 -0.20682 1.429288
C  -5.408661 -0.194754 -0.862569
C  1.211642 -0.92176 0.126524
C  -1.470904 2.447983 -0.28515
C  2.583881 -0.614569 0.279371
C  -0.101811 2.63627 -0.145701
C  2.925829 0.788135 0.268262
C  3.84899 -1.32597 0.453496
C  4.838072 -0.37204 0.531699
C  1.534125 -3.358999 0.494347
H  -3.701329 -2.342346 -0.805159
H  -1.225292 -2.165373 -0.797967
H  -4.80215 -1.122595 1.761888
H  -3.308608 -0.159054 1.95115
H  -4.885713 0.671302 1.716683
H  -5.234381 -0.188757 -1.951616
H  -6.021923 -1.07723 -0.60537
H  -5.971577 0.714889 -0.591948
H  -2.165916 3.287572 -0.37591
H  0.346133 3.632995 -0.117813
H  4.03143 -2.394955 0.505648
H  5.915926 -0.438162 0.653284
H  2.276128 -3.551782 -0.301144
H  0.839637 -4.209123 0.56568
H  2.037486 -3.20568 1.465534
