program: Gaussian 09
title: 000266033
version: EM64L-G09RevD.01
frameworkgroup: C1[X(C12H12N4O4)]
method: RPBEPBE
basis: SDD
operation: Freq
keyword: #p
keyword: freq=noraman
keyword: PBEPBE/SDD
title: #p freq=noraman PBEPBE/SDD
converged: YES YES NO NO
title: Mulliken charges:
elementType: O O O O N N N N C C C C C C C C C C C C H H H H H H H H H H H H
charge: -0.445578 -0.445515 -0.206137 -0.206155 -0.383658 -0.383621 -0.095459 -0.095462 -0.251729 -0.251778 -0.261152 -0.261187 0.165805 0.165877 0.147803 0.147751 -0.216352 -0.216363 -0.324807 -0.324806 0.312622 0.312564 0.322210 0.322290 0.335862 0.335823 0.258954 0.258953 0.387691 0.387685 0.253935 0.253934
chargesum: 0.00000
title: Mulliken charges with hydrogens summed into heavy atoms:
elementType: O O O O N N N N C C C C C C C C C C C C
charge: -0.057887 -0.057830 -0.206137 -0.206155 -0.047796 -0.047798 -0.095459 -0.095462 0.060893 0.060785 0.061058 0.061103 0.165805 0.165877 0.147803 0.147751 0.042602 0.042591 -0.070872 -0.070872
polarizability: 1.93104814e+02 9.15567616e-03 1.47938620e+02 2.21827992e+00 7.92615343e-03 1.37725481e+02
1716.lowfreq: -9.7975 -6.2654 -4.5146 -0.0008 -0.0004 0.0004 24.5219 25.1511 32.5374
frequency: 23.2141 24.9794 32.5313 51.5415 57.8327 67.2019 67.8669 86.9231 97.0396 166.6729 181.1308 198.5758 266.9493 300.8208 302.7198 339.0790 356.3486 414.4864 478.1952 552.5324 557.4667 594.9150 599.4058 600.0387 626.3111 628.6898 659.3201 674.5269 705.4992 707.1641 709.1091 713.8967 741.7692 741.9865 785.0642 786.5919 848.9205 848.9535 882.0064 899.0921 908.3485 938.5544 966.9462 968.5959 985.7805 999.3138 1011.8882 1061.8928 1063.5936 1077.1064 1094.0938 1096.6698 1096.7422 1121.3096 1129.7195 1156.3317 1160.9403 1170.6670 1170.9552 1189.8704 1228.5944 1229.5420 1246.7708 1260.2784 1302.0562 1311.7383 1327.3174 1349.1022 1355.0376 1373.6617 1387.2045 1419.3434 1464.6603 1467.9723 1532.7215 1539.6299 1670.9464 1680.2975 3024.0519 3033.5665 3040.0570 3050.1610 3228.9715 3229.0035 3258.1315 3258.1774 3515.9492 3516.1579 3558.8654 3558.9969
redmass: 5.3042 6.1737 6.1372 9.9673 8.4684 6.0455 7.0291 6.0828 7.8312 5.9946 5.7910 5.7296 7.5574 7.0292 5.6305 5.0139 7.3025 5.3991 4.3004 2.2310 2.8276 2.6700 1.8085 2.1218 3.1888 3.2705 2.9991 3.8446 4.5797 1.3140 1.1795 2.9813 1.2870 1.3112 4.6257 5.9493 1.3672 1.3702 6.9533 6.8739 7.0251 4.5546 3.5254 5.4804 4.2900 3.7888 3.4750 2.2145 1.9069 1.6948 2.5265 1.9582 1.7454 1.5725 1.4392 1.6306 2.0468 1.7447 1.6180 1.2796 1.6392 1.5372 1.4426 1.6720 1.8837 1.6509 1.8099 3.2370 2.7927 2.6716 3.1189 2.4029 4.5580 4.3247 4.0948 4.5213 9.1239 9.1379 1.0855 1.0849 1.0846 1.0834 1.0916 1.0916 1.1087 1.1087 1.0641 1.0641 1.0827 1.0827
irintensity: 5.3538 8.8125 8.3777 2.1660 0.0993 5.4108 0.1496 5.2298 0.0101 1.0302 0.0003 7.8419 1.8001 4.3988 4.8688 2.6814 2.7314 5.4970 41.1276 95.4399 60.8509 30.5586 61.1894 19.6825 6.8448 0.0599 14.6442 9.4067 2.9612 48.0182 177.3856 84.5148 90.3362 44.8099 0.9792 12.5163 14.9084 9.3067 66.3615 1.8434 16.6548 8.0338 29.8345 8.0770 2.9023 26.0369 0.9960 3.2909 255.1242 150.7888 0.0115 46.8120 1.6725 8.6467 12.2218 28.7582 2.7971 57.5340 19.4305 0.8701 3.4934 9.4309 6.0946 3.6173 68.3774 30.7391 9.6926 14.9541 2.9715 1.1520 25.5885 27.2381 1.8292 0.3983 57.5510 23.0988 227.6732 295.5592 1.1601 3.7328 0.0096 3.3077 5.0046 2.4783 8.4562 2.0667 58.9762 4.6400 81.1799 58.0168
temp: 298.150 k
press: 1.00000 atm
elementType: 8 8 8 8 7 7 7 7 6 6 6 6 6 6 6 6 6 6 6 6 1 1 1 1 1 1 1 1 1 1 1 1
symmnumber: 1
zpe: 623049.0 jmol-1
zpe.correction: 0.237307 hartree
zpe.thermalcorrener: 0.255059 hartree
zpe.thermalcorrenthalpy: 0.256003 hartree
zpe.thermalcorrgfe: 0.187694 hartree
zpe.sumelectzpe: -982.930805 hartree
zpe.sumelectthermal: -982.913053 hartree
zpe.sumelectthermalent: -982.912109 hartree
zpe.sumelectthermalfe: -982.980419 hartree
dipole: 0.0007 1.0862 -0.0020
dipole: 1.0862
quadrupole: -81.7388 -131.3727 -112.2095
quadrupole: 0.0048 17.4840 0.0021
quadrupole: 26.7015 -22.9324 -3.7691 0.0048 17.4840 0.0021
hfenergy: -983.1681122 hartree
pointgroup: C01 [X(C12H12N4O4)]
dipole: -0.0018987 0.4273443 0.0004858 debye
polarizability: 193.153104|0.1654151|147.9392077|1.4868914|-0.0094548|137.6766036 unknown
InChI: InChI=1S/C12H12N4O4/c17-11(18)7-5(9-13-1-2-14-9)6(8(7)12(19)20)10-15-3-4-16-10/h1-8,13,15,17,19H
charge 0 multiplicity 1
32 atoms
O  -2.471683 1.804783 -1.816648
O  2.458359 1.827023 1.814404
O  -0.514227 3.044876 -2.033926
O  0.491534 3.052471 2.029951
N  -3.097913 -0.91192 -0.186333
N  3.104439 -0.888917 0.189245
N  -1.690845 -1.731765 1.378921
N  1.70427 -1.720176 -1.376167
C  -0.689305 -0.170582 -0.362162
C  0.690499 -0.164922 0.363186
C  -0.756435 1.409685 -0.192431
C  0.745597 1.415616 0.191521
C  -1.786993 -0.949726 0.281564
C  1.794111 -0.93659 -0.279376
C  -1.173235 2.191609 -1.407585
C  1.156372 2.202112 1.40579
C  -3.87709 -1.71498 0.654817
C  3.889918 -1.68694 -0.65082
C  -2.990149 -2.216517 1.610783
C  3.007185 -2.195675 -1.606894
H  -0.555916 -0.458842 -1.420309
H  0.559297 -0.452822 1.421696
H  -1.40484 1.689264 0.656821
H  1.391793 1.699088 -0.65812
H  -3.417961 -0.331787 -0.964012
H  3.419838 -0.305688 0.966499
H  -4.944026 -1.856749 0.507468
H  4.957762 -1.820875 -0.502729
H  -2.730587 2.336247 -2.617857
H  2.713663 2.362463 2.61412
H  -3.200052 -2.888567 2.439186
H  3.222421 -2.866894 -2.434603
