program: Gaussian 09
title: 000266057
version: EM64L-G09RevD.01
frameworkgroup: C1[X(C17H19N5O3S)]
method: RPBEPBE
basis: SDD
operation: Freq
keyword: #p
keyword: freq=noraman
keyword: PBEPBE/SDD
title: #p freq=noraman PBEPBE/SDD
converged: YES YES NO NO
title: Mulliken charges:
elementType: S O O O N N N N N C C C C C C C C C C C C C C C C C H H H H H H H H H H H H H H H H H H H
charge: 0.294649 -0.313334 -0.436253 -0.435065 -0.212314 -0.044574 -0.220225 -0.054338 -0.591162 -0.038455 -0.137178 -0.517235 -0.070483 -0.321449 0.259060 -0.209401 0.090878 -0.359137 0.007199 -0.804063 0.475286 -0.376421 -0.377413 -0.220358 -0.220502 -0.234872 0.255549 0.221574 0.252844 0.242519 0.256292 0.192398 0.222574 0.378975 0.283533 0.352081 0.286845 0.288436 0.334185 0.336092 0.237646 0.237651 0.228552 0.228559 0.230854
chargesum: 0.00000
title: Mulliken charges with hydrogens summed into heavy atoms:
elementType: S O O O N N N N N C C C C C C C C C C C C C C C C C
charge: 0.294649 -0.313334 -0.057278 -0.082983 -0.212314 -0.044574 -0.220225 -0.054338 0.079116 0.217095 0.084396 -0.021872 0.185809 0.093524 0.259060 0.074132 0.090878 -0.359137 0.007199 -0.228782 0.475286 -0.138775 -0.139762 0.008194 0.008057 -0.004018
polarizability: 3.97721085e+02 1.54270118e+01 2.27202188e+02 -3.60497524e+00 7.94562917e+00 1.66886311e+02
1716.lowfreq: -1.5824 -0.0016 -0.0011 0.0013 4.1664 8.2587 14.8505 23.7356 32.1187
frequency: 14.5633 23.5860 32.0293 33.0741 38.8718 51.4776 81.9093 93.8596 101.3213 124.1320 131.7082 139.1805 160.7545 179.1281 230.2783 235.1082 241.9518 255.5276 290.5615 324.3915 328.1480 340.9882 353.7251 395.1108 402.6454 427.9129 428.8825 448.0517 459.9770 473.3599 486.5858 501.9890 510.2990 552.6492 556.6897 590.1530 611.3179 617.1683 623.0024 633.2819 660.1285 683.4876 702.2293 709.9718 761.7512 776.2255 776.7251 785.0699 809.6817 818.1655 826.9752 852.5273 859.0316 876.6765 886.7968 894.1079 925.6517 926.9559 958.5936 967.4919 977.8248 984.3942 989.8790 997.3487 1005.8510 1026.6356 1027.0802 1044.7429 1067.6266 1073.8025 1078.3513 1108.9065 1115.8520 1123.9340 1165.1490 1173.5696 1179.4480 1188.1258 1193.4657 1203.5871 1218.8093 1243.2676 1244.9057 1255.3603 1282.7350 1292.8184 1297.7503 1304.4647 1318.1445 1325.1503 1329.6726 1336.6486 1351.1844 1362.0768 1384.7340 1384.7641 1386.0277 1433.4717 1440.4539 1444.0679 1460.9404 1466.5493 1471.7298 1484.3626 1510.8250 1527.2132 1558.9218 1593.5855 1613.9021 1614.7632 2944.1481 2954.7927 2980.1708 2988.7605 3030.4829 3051.2562 3054.6498 3073.0038 3098.7303 3123.0525 3124.3248 3127.7205 3137.5369 3149.7580 3166.0117 3260.3212 3539.2783 3563.8900 3719.2732
redmass: 5.8885 3.9602 5.7295 6.3295 6.0142 5.7140 6.0507 4.2220 5.1662 3.9681 5.8682 6.9075 6.2392 7.0181 3.8021 4.7690 7.5872 5.5595 6.0440 2.2716 4.3104 5.4560 4.1337 4.4920 2.8013 3.8247 4.5874 1.2068 1.2121 3.9611 3.0012 1.0729 6.6145 6.2612 6.0866 8.0560 6.4479 6.3292 4.8952 5.7577 5.1149 4.8808 1.6481 11.6622 3.9900 2.1806 6.3974 4.3548 3.9784 4.1573 1.6631 1.2503 1.1967 2.3942 1.5314 6.0177 2.2193 1.5511 3.7341 2.4527 1.3910 3.5424 5.9349 1.3343 4.2437 2.2593 2.4844 2.4186 3.8552 1.4855 3.2068 2.4572 3.6747 1.0853 1.3099 1.0523 1.9633 1.1164 2.0534 1.8469 1.9066 1.5765 1.4276 1.5789 2.9638 1.4731 1.2961 1.3650 3.5965 1.2796 1.3650 4.3270 1.2886 1.3081 4.7216 8.7585 1.4258 3.9675 2.1746 1.1221 1.0993 1.6008 1.1240 2.3624 2.6339 5.9600 8.8856 6.0976 2.2624 2.5464 1.0809 1.0697 1.0823 1.0720 1.0612 1.0579 1.0872 1.0956 1.1049 1.0852 1.0927 1.1038 1.0920 1.0964 1.1017 1.0986 1.0653 1.0446 1.1058
irintensity: 0.1660 0.0078 0.1552 0.3222 0.2980 0.6616 0.6945 2.8191 1.9928 4.7330 3.0901 0.5944 2.6512 4.9825 0.7656 3.8563 0.7123 2.0191 10.6246 0.4019 11.5276 6.0324 8.4831 1.0800 0.0125 3.4484 10.7375 109.4181 261.1756 6.5563 8.2224 34.3923 3.0625 13.7358 13.8286 1.1432 6.9393 0.0984 12.0523 14.9528 19.1065 8.8359 60.5316 4.6977 21.2511 27.9989 7.8908 57.9481 6.2057 6.1322 20.1944 0.0160 137.2570 15.1034 0.6386 174.8859 7.2110 1.7950 95.0378 31.3156 0.0154 37.3908 0.8401 0.1516 41.6171 28.2794 34.4314 34.5372 14.2922 8.6933 37.7402 2.3439 79.7351 1.7506 2.2692 0.0294 21.0264 5.7574 165.3179 6.6076 0.1970 28.2279 26.9672 15.8190 16.4084 18.4439 5.3522 33.7058 28.3390 0.2686 120.1629 34.8672 35.9252 27.1470 54.8543 0.2418 42.3513 71.8420 8.7570 11.2912 6.7199 49.1160 30.0332 15.8963 339.4803 291.0643 232.9616 1.0471 238.8756 205.1990 65.3087 50.5205 215.2165 877.8364 13.1296 6.5521 12.2911 66.1541 16.8998 6.7254 0.0443 4.2521 15.3315 38.8869 25.7985 2.7206 6.3887 127.7929 47.9193
temp: 298.150 k
press: 1.00000 atm
elementType: 16 8 8 8 7 7 7 7 7 6 6 6 6 6 6 6 6 6 6 6 6 6 6 6 6 6 1 1 1 1 1 1 1 1 1 1 1 1 1 1 1 1 1 1 1
symmnumber: 1
zpe: 913562.0 jmol-1
zpe.correction: 0.347957 hartree
zpe.thermalcorrener: 0.371529 hartree
zpe.thermalcorrenthalpy: 0.372473 hartree
zpe.thermalcorrgfe: 0.291644 hartree
zpe.sumelectzpe: -1554.802113 hartree
zpe.sumelectthermal: -1554.778542 hartree
zpe.sumelectthermalent: -1554.777598 hartree
zpe.sumelectthermalfe: -1554.858427 hartree
dipole: -1.5550 4.6501 0.9570
dipole: 4.9957
quadrupole: -143.8256 -164.8986 -154.6143
quadrupole: 5.4076 -2.3019 2.7944
quadrupole: 10.6206 -10.4525 -0.1681 5.4076 -2.3019 2.7944
hfenergy: -1555.1500708 hartree
pointgroup: C01 [X(C17H19N5O3S1)]
dipole: -0.6246947 -1.8165825 -0.4158008 debye
polarizability: 397.6568502|-15.9508911|226.83874|-0.4373778|9.8025026|167.3139942 unknown
InChI: InChI=1S/C17H19N5O3S/c18-17-20-14-13(15(21-17)26-8-10-4-2-1-3-5-10)19-9-22(14)16-12(24)6-11(7-23)25-16/h1-5,9,11-12,16,23-24H,6-8,18H2
charge 0 multiplicity 1
45 atoms
S  -2.572275 0.792127 0.421296
O  4.718322 1.129485 0.76818
O  3.976382 -2.364663 -0.123849
O  5.81028 3.117694 -0.920832
N  2.443632 0.404025 0.733592
N  0.58182 1.733966 0.963506
N  1.341059 -1.717529 0.060343
N  -1.099977 -1.480277 -0.078615
N  -0.048546 -3.514651 -0.548829
C  3.847793 -0.045368 0.821913
C  4.271887 -0.972426 -0.358368
C  5.789251 -0.712658 -0.416192
C  5.924534 0.789708 -0.094104
C  5.877558 1.713636 -1.320901
C  1.348885 -0.401261 0.422805
C  1.918478 1.67496 1.063494
C  0.20269 0.437681 0.564697
C  -1.050606 -0.172382 0.287161
C  0.074879 -2.197046 -0.176432
C  -3.858934 -0.552164 -0.063143
C  -5.234573 0.066886 -0.074917
C  -5.747791 0.661165 -1.257203
C  -6.038904 0.063748 1.094378
C  -7.038219 1.234796 -1.272675
C  -7.329802 0.636916 1.08152
C  -7.833395 1.223791 -0.102799
H  3.997035 -0.582003 1.781858
H  3.777419 -0.595826 -1.281331
H  6.278859 -1.336446 0.351299
H  6.211947 -0.97371 -1.400754
H  6.804336 1.036464 0.524289
H  5.018602 1.438117 -1.971095
H  6.81106 1.616952 -1.901999
H  2.955689 -2.411885 -0.078824
H  2.569139 2.493512 1.356384
H  5.066752 3.200845 -0.26832
H  -3.75415 -1.358445 0.678264
H  -3.5459 -0.930871 -1.04759
H  0.776168 -4.100973 -0.641529
H  -0.977585 -3.884919 -0.727458
H  -5.131552 0.675311 -2.164246
H  -5.649598 -0.387425 2.015073
H  -7.422753 1.688649 -2.192795
H  -7.940835 0.62579 1.990911
H  -8.834867 1.668207 -0.113861
