program: Gaussian 09
title: 000266040
version: EM64L-G09RevD.01
frameworkgroup: C1[X(C16H13NO5)]
method: RPBEPBE
basis: SDD
operation: Freq
keyword: #p
keyword: freq=noraman
keyword: PBEPBE/SDD
title: #p freq=noraman PBEPBE/SDD
converged: YES YES NO NO
title: Mulliken charges:
elementType: O O O O O N C C C C C C C C C C C C C C C C H H H H H H H H H H H H H
charge: -0.255506 -0.210789 -0.210686 -0.226893 -0.161394 -0.203379 0.183385 0.141255 0.207827 0.192994 0.061762 -0.020259 -0.101363 -0.635867 0.105513 0.072545 -0.327333 -0.359291 -0.235819 -0.247574 -0.516560 -0.497968 0.259072 0.233110 0.275844 0.259100 0.287113 0.235412 0.240284 0.234898 0.217943 0.264226 0.234277 0.239547 0.264570
chargesum: 0.00000
title: Mulliken charges with hydrogens summed into heavy atoms:
elementType: O O O O O N C C C C C C C C C C C C C C C C
charge: -0.255506 -0.210789 -0.210686 -0.226893 -0.161394 -0.203379 0.183385 0.141255 0.207827 0.192994 0.061762 -0.020259 -0.101363 0.132160 0.105513 0.072545 -0.068233 -0.072178 -0.000406 -0.007290 0.200508 0.240427
polarizability: 3.31088642e+02 -1.57183906e+01 2.55707202e+02 2.91434781e+00 1.89405593e+00 9.26037449e+01
1716.lowfreq: -5.9841 -3.5203 0.0005 0.0006 0.0009 6.6018 31.6421 42.5146 56.9419
frequency: 31.6378 42.4828 56.9306 67.0895 83.8225 101.2488 119.9102 144.2016 152.2860 166.5141 179.6501 198.9718 204.3771 229.8168 242.9816 282.3204 290.9503 313.3870 325.1615 341.1632 376.0743 377.7208 396.7274 427.3843 439.0295 451.8041 464.7950 496.4642 514.5409 525.8816 552.0369 600.4435 622.3083 662.9248 682.1756 721.5513 738.1687 767.8681 776.8670 789.9167 822.0911 828.2483 875.9938 882.7575 893.4233 958.8703 972.0298 996.4310 1004.8362 1039.4644 1064.5331 1099.1548 1101.6769 1102.5795 1110.0580 1117.8630 1128.2010 1145.2097 1152.3534 1180.4130 1209.2467 1250.4044 1265.8969 1277.2938 1303.7244 1329.7981 1386.1056 1399.5801 1422.2488 1435.0731 1442.1000 1449.6085 1450.5867 1454.3857 1456.3354 1458.1175 1469.1337 1480.3816 1485.7704 1506.1588 1511.7881 1536.2381 1565.2555 1573.3402 1597.3996 1615.6249 2984.1512 3012.0766 3014.4757 3095.7152 3102.7305 3126.7321 3136.3082 3139.1655 3146.3268 3153.1047 3167.9640 3169.8436 3180.4540
redmass: 6.2724 4.7758 2.5101 5.7785 6.3433 2.9975 3.3150 2.9097 1.5239 3.0111 1.3710 4.6516 1.4305 3.9842 3.9718 7.1712 7.1223 6.1464 7.2491 8.3626 5.4763 7.1268 5.0133 4.3486 3.9435 6.2922 6.2759 8.7504 5.9629 6.7254 4.5094 6.7377 7.5733 5.8380 5.7644 6.3245 7.4335 2.5051 2.2970 5.3913 7.1855 8.1973 7.3449 1.4782 9.3726 7.3326 1.3640 6.1822 1.3403 2.1469 5.6445 3.4353 1.3498 1.2786 1.4501 1.6411 1.8810 1.4595 1.4824 1.1174 2.4522 5.8035 5.2305 1.9346 4.5778 6.2978 3.7770 10.9212 1.2176 1.2153 1.2542 2.0542 1.1148 1.0879 1.0902 2.0442 1.3272 1.0573 1.3005 4.1613 7.3358 5.7996 9.6701 8.7362 8.2459 6.7796 1.0329 1.0286 1.0370 1.0999 1.1033 1.1045 1.1049 1.0864 1.1066 1.0903 1.0964 1.0975 1.0970
irintensity: 4.4649 0.9541 8.8894 1.7983 2.2898 3.9542 1.0165 3.1346 1.2876 0.6289 0.1518 7.5380 1.7013 9.1443 4.7504 1.4896 6.5491 1.3456 3.2871 3.4083 16.3543 3.6023 5.0704 5.7752 2.8383 0.7060 13.9102 2.2111 2.6592 1.1677 2.3104 7.5417 9.0923 6.4062 6.7074 13.5537 8.6369 49.8856 41.5161 1.4248 7.0301 18.7231 18.9661 0.2681 20.9863 32.8676 2.5084 125.2816 0.9218 45.2933 30.5013 112.4252 44.9757 0.5113 7.9000 12.8357 28.1728 12.1155 52.5168 9.7835 34.8399 69.8744 270.3917 11.5707 15.4649 172.4126 96.7931 6.4157 32.3598 56.0554 0.3485 37.0127 63.0214 39.1444 11.6697 51.4025 92.5927 28.6439 32.1289 183.0569 113.4834 39.2001 205.8060 202.1781 82.9150 27.1143 83.3489 46.9947 31.2003 27.2821 15.4129 31.0136 16.0359 4.7844 18.7570 4.7332 19.2205 1.2123 17.4284
temp: 298.150 k
press: 1.00000 atm
elementType: 8 8 8 8 8 7 6 6 6 6 6 6 6 6 6 6 6 6 6 6 6 6 1 1 1 1 1 1 1 1 1 1 1 1 1
symmnumber: 1
zpe: 677064.9 jmol-1
zpe.correction: 0.257880 hartree
zpe.thermalcorrener: 0.277738 hartree
zpe.thermalcorrenthalpy: 0.278682 hartree
zpe.thermalcorrgfe: 0.209296 hartree
zpe.sumelectzpe: -1046.761145 hartree
zpe.sumelectthermal: -1046.741288 hartree
zpe.sumelectthermalent: -1046.740344 hartree
zpe.sumelectthermalfe: -1046.809730 hartree
dipole: 1.9702 -4.0772 -0.2736
dipole: 4.5365
quadrupole: -100.5273 -131.0829 -126.7560
quadrupole: -13.2482 -2.3857 -2.7011
quadrupole: 18.9281 -11.6275 -7.3006 -13.2482 -2.3857 -2.7011
hfenergy: -1047.0190256 hartree
pointgroup: C01 [X(C16H13N1O5)]
dipole: -0.8233292 -1.5811896 0.0866069 debye
polarizability: 330.3770703|14.1952362|254.7941684|18.7948801|-4.5852976|94.2283509 unknown
InChI: InChI=1S/C16H13NO5/c1-17-9-7-5-4-6-8(9)12(18)10-11(17)14(20)16(22-3)15(21-2)13(10)19/h4-7H,1-3H3
charge 0 multiplicity 1
35 atoms
O  3.697664 -1.695843 0.827578
O  3.880653 1.002986 0.709157
O  -1.099052 2.745521 0.29778
O  1.216483 -2.887691 0.161375
O  1.613441 2.436895 -0.322079
N  -1.220269 -1.416606 0.452941
C  0.008083 -0.771865 0.360519
C  0.104542 0.624492 0.226913
C  -2.417207 -0.699768 0.171541
C  -2.37886 0.720702 0.046431
C  -1.104746 1.47683 0.202081
C  1.272245 -1.622451 0.339936
C  1.438569 1.258984 0.123923
C  -1.369258 -2.816262 0.945804
C  2.55917 -0.945843 0.539833
C  2.645049 0.444718 0.523239
C  -3.658408 -1.381943 0.013058
C  -3.576346 1.433996 -0.211797
C  -4.830748 -0.654689 -0.25478
C  -4.798973 0.760666 -0.360698
C  4.182886 -2.64003 -0.211269
C  4.066368 2.458744 0.951241
H  -1.46787 -3.530578 0.111765
H  -2.26302 -2.856011 1.589429
H  -0.490738 -3.108372 1.529778
H  -3.709794 -2.471968 0.062123
H  -3.499122 2.523915 -0.281743
H  -5.775113 -1.193167 -0.389098
H  -5.719515 1.318199 -0.560304
H  5.101705 -3.070575 0.213309
H  4.419152 -2.090117 -1.141569
H  3.433507 -3.424646 -0.401253
H  5.078418 2.51833 1.378852
H  3.314611 2.841173 1.661177
H  3.989996 3.013572 0.005309
