program: Gaussian 09
title: 000266074
version: EM64L-G09RevD.01
frameworkgroup: C1[X(C18H24N2O4S2)]
method: RPBEPBE
basis: SDD
operation: Freq
keyword: #p
keyword: freq=noraman
keyword: PBEPBE/SDD
title: #p freq=noraman PBEPBE/SDD
converged: YES YES NO NO
title: Mulliken charges:
elementType: S S O O O O N N C C C C C C C C C C C C C C C C C C H H H H H H H H H H H H H H H H H H H H H H H H
charge: 0.983503 0.983357 -0.533618 -0.535330 -0.533646 -0.535383 -0.235918 -0.235990 -0.570773 -0.570810 0.519868 0.519801 -0.110645 -0.110410 -0.394519 -0.394302 -0.401350 -0.401383 -0.236523 -0.236580 -0.240215 -0.240232 -0.615403 -0.618652 -0.615244 -0.618501 0.226224 0.232008 0.226221 0.231993 0.245640 0.245636 0.247453 0.247446 0.284382 0.284274 0.285855 0.285874 0.277211 0.252323 0.203062 0.278146 0.204793 0.252491 0.252409 0.202945 0.277177 0.278082 0.204764 0.252491
chargesum: 0.00000
title: Mulliken charges with hydrogens summed into heavy atoms:
elementType: S S O O O O N N C C C C C C C C C C C C C C C C C C
charge: 0.983503 0.983357 -0.533618 -0.535330 -0.533646 -0.535383 -0.235918 -0.235990 -0.112542 -0.112597 0.519868 0.519801 -0.110645 -0.110410 -0.148879 -0.148667 -0.153897 -0.153937 0.047860 0.047694 0.045640 0.045641 0.117193 0.116778 0.117287 0.116837
polarizability: 2.80993139e+02 1.95782355e-03 3.04320646e+02 -2.68546595e+01 -9.76492333e-03 2.25241694e+02
1716.lowfreq: -11.8951 -0.5598 -0.0015 -0.0009 0.0013 7.8140 14.2813 18.2317 21.5891
frequency: 13.7777 17.9431 21.0499 22.0157 40.4516 41.9729 44.2411 61.2642 63.5114 80.6858 82.2150 113.1878 130.9773 152.8358 169.6583 204.2087 204.4954 211.2896 218.6146 219.3397 220.5993 233.0031 245.0935 245.4193 255.4535 274.2189 283.8545 289.0347 295.9673 316.4108 349.1823 362.4722 365.9206 390.4061 406.2946 406.7379 409.4819 411.8533 414.2686 428.3074 430.1454 480.2892 497.0231 526.5476 543.3576 576.8505 604.4674 621.5159 622.6643 722.5603 725.0679 755.7585 763.2902 809.5495 809.9473 829.2818 845.8504 854.0595 854.6150 858.2572 859.3779 928.9004 942.1041 954.1013 954.6217 968.8808 972.4769 982.5177 983.3316 992.6482 995.2198 999.4260 1016.1351 1016.3923 1050.1490 1050.8652 1081.0193 1083.7992 1096.7456 1108.3228 1110.6304 1115.4817 1147.1883 1177.0178 1177.3643 1180.1294 1182.9342 1183.2070 1203.8128 1206.5790 1207.8760 1223.0202 1286.1281 1296.8032 1309.9911 1333.8842 1386.0750 1386.5442 1397.0515 1397.1514 1404.7681 1406.7124 1416.2619 1417.9035 1452.2590 1452.9578 1461.8920 1463.1545 1465.2911 1465.6553 1468.1270 1470.2527 1474.5787 1474.6472 1475.8342 1478.1146 1590.4771 1590.8339 1592.4818 1594.5875 2898.4667 2903.3067 2912.3184 2912.4280 2990.3009 2997.7839 3036.0126 3037.4008 3040.1716 3040.4226 3046.6729 3061.6522 3095.0277 3095.4943 3098.7101 3098.7855 3127.5499 3127.5961 3135.5420 3135.9956 3156.9506 3156.9837 3160.3132 3160.4415
redmass: 5.4800 4.0080 4.6098 5.2081 2.8937 4.2653 3.0546 3.8577 3.8913 4.6372 5.1968 5.7439 6.2919 4.7902 4.7528 4.4792 5.0640 1.8427 1.3635 1.2372 1.0560 7.2362 2.5010 2.2979 4.5193 4.5999 3.5182 3.7033 3.7882 6.2604 2.8066 4.1525 2.4811 3.3745 3.9561 3.1972 3.3561 3.8453 3.7274 7.9004 7.2838 5.9506 6.6528 3.8735 3.4153 4.7391 3.2325 6.8917 6.9533 4.0102 3.1128 4.2028 3.4755 14.0328 14.4732 1.4140 1.5314 1.2656 1.2732 4.0121 4.1597 2.0785 2.3736 12.5115 14.3707 1.3523 1.4578 1.3859 1.3842 3.4072 5.2258 2.9648 1.4308 1.4280 2.4982 2.4408 1.2286 1.2277 1.3703 1.3738 1.3739 1.3453 1.1508 5.2195 5.2339 1.4266 1.1473 1.1328 2.1219 1.6823 1.6659 2.0112 1.3142 1.2718 1.3237 1.5022 7.1418 6.9105 2.5335 2.7742 1.1326 1.1290 1.1407 1.1392 1.0464 1.0465 1.0496 1.0605 1.3476 1.1417 1.1405 1.8482 1.1339 1.4056 1.0938 1.0834 7.4277 7.3833 6.1210 6.0577 1.0494 1.0488 1.0476 1.0477 1.0598 1.0608 1.0829 1.0839 1.0845 1.0843 1.1024 1.1024 1.0988 1.0987 1.0991 1.0991 1.0893 1.0893 1.0888 1.0888 1.0949 1.0949 1.0966 1.0966
irintensity: 3.2379 2.3435 4.6305 0.0384 0.3133 2.5852 0.1895 0.2693 0.2646 1.2218 1.7368 0.2280 2.2048 0.0039 1.2731 0.3081 1.0266 0.0719 5.1400 3.3101 0.4044 4.0061 8.6444 5.2490 1.3787 0.6114 0.4869 1.4523 4.1815 8.4532 0.0035 4.2793 0.0915 0.8215 0.0119 0.0285 0.4524 0.0078 12.9548 76.1309 54.1152 83.2267 44.0037 12.8755 83.3732 61.4532 20.1363 0.2116 0.3329 0.0170 1.7552 0.0005 2.8467 210.2806 6.6778 40.4141 13.0933 0.5300 1.0674 79.2269 1.2273 17.5012 0.6415 21.3802 120.3097 3.8881 2.3429 0.6050 0.0164 0.1336 1.6321 5.7561 1.2540 0.0645 17.8575 23.1230 0.1652 0.1188 8.9908 17.8357 16.1272 7.0202 2.3228 21.4048 3.3135 3.3871 1.6418 16.4363 3.3735 9.9825 10.4181 0.0001 1.7246 1.7624 0.0706 3.0848 0.7033 3.9204 4.1825 17.1966 44.2299 4.9080 3.3079 1.2782 6.9586 41.3774 1.1878 2.1229 21.4260 25.9906 6.2549 14.5582 21.8059 10.1136 42.3725 12.6270 0.1669 0.2687 12.8042 0.9122 152.8913 0.1266 21.1079 124.6028 16.1121 50.6140 2.5061 16.1624 23.8769 47.1740 12.1361 28.7959 0.1804 2.8303 0.9917 2.6844 11.2278 6.5630 0.5924 14.3248 1.3549 0.8688 9.5425 10.6994
temp: 298.150 k
press: 1.00000 atm
elementType: 16 16 8 8 8 8 7 7 6 6 6 6 6 6 6 6 6 6 6 6 6 6 6 6 6 6 1 1 1 1 1 1 1 1 1 1 1 1 1 1 1 1 1 1 1 1 1 1 1 1
symmnumber: 1
zpe: 1019444.6 jmol-1
zpe.correction: 0.388286 hartree
zpe.thermalcorrener: 0.417404 hartree
zpe.thermalcorrenthalpy: 0.418348 hartree
zpe.thermalcorrgfe: 0.324667 hartree
zpe.sumelectzpe: -1904.508105 hartree
zpe.sumelectthermal: -1904.478987 hartree
zpe.sumelectthermalent: -1904.478043 hartree
zpe.sumelectthermalfe: -1904.571724 hartree
dipole: 0.0000 6.1847 0.0044
dipole: 6.1847
quadrupole: -255.4143 -154.9884 -166.9246
quadrupole: 0.0702 -28.3617 0.0018
quadrupole: -62.9719 37.4540 25.5178 0.0702 -28.3617 0.0018
hfenergy: -1904.8963909 hartree
pointgroup: C01 [X(C18H24N2O4S2)]
dipole: -0.0017375 -2.4332263 0.0085699 debye
polarizability: 282.1345439|0.0904071|304.3199471|25.6169474|-0.234372|224.1009874 unknown
InChI: InChI=1S/C18H24N2O4S2/c1-19(2)25(21,22)17-11-7-15(8-12-17)5-6-16-9-13-18(14-10-16)26(23,24)20(3)4/h7-14H,5-6H2,1-4H3
charge 0 multiplicity 1
50 atoms
S  -4.138028 1.30026 0.462765
S  4.136554 1.288757 -0.472807
O  -5.56377 0.856785 -0.179786
O  -3.985667 2.047748 1.898561
O  5.561396 0.844801 0.171426
O  3.985412 2.027785 -1.913113
N  -3.381741 2.501171 -0.797915
N  3.386035 2.500466 0.780896
C  -0.50855 -3.747438 0.611634
C  0.496091 -3.752041 -0.59202
C  -1.423502 -2.533182 0.608344
C  1.413422 -2.539533 -0.595706
C  -3.04849 -0.251833 0.526008
C  3.042901 -0.260953 -0.526268
C  -1.177794 -1.439636 1.479013
C  1.16887 -1.449777 -1.471442
C  -2.522834 -2.461361 -0.288809
C  2.513741 -2.465357 0.300037
C  -1.991084 -0.285258 1.449513
C  1.984461 -0.296871 -1.4485
C  -3.349262 -1.317709 -0.339662
C  3.342423 -1.323055 0.344428
C  -2.058272 2.981106 -0.34437
C  -3.428773 1.933811 -2.163539
C  2.064991 2.984893 0.325278
C  3.431296 1.941535 2.149997
H  0.066397 -3.784879 1.555374
H  -1.106039 -4.677573 0.558417
H  -0.078831 -3.793853 -1.535597
H  1.09167 -4.68305 -0.533244
H  -0.345923 -1.493292 2.190432
H  0.336172 -1.505313 -2.181749
H  -2.744711 -3.311881 -0.944715
H  2.734673 -3.313061 0.959893
H  -1.835746 0.549626 2.140724
H  1.830164 0.534806 -2.143801
H  -4.220684 -1.262891 -1.000593
H  4.214649 -1.266653 1.004157
H  -2.130042 3.271784 0.716951
H  -1.819815 3.887178 -0.93063
H  -1.234053 2.242602 -0.48259
H  -4.431498 1.510477 -2.33961
H  -2.649691 1.162423 -2.362136
H  -3.283637 2.769845 -2.8715
H  1.832933 3.897066 0.904627
H  1.236379 2.25271 0.470557
H  2.137094 3.26678 -0.738402
H  4.431903 1.513933 2.327819
H  2.648195 1.175709 2.354231
H  3.291418 2.782798 2.852815
