program: Gaussian 09
title: 000266018
version: EM64L-G09RevD.01
frameworkgroup: C1[X(C9H13N3O6)]
method: RPBEPBE
basis: SDD
operation: Freq
keyword: #p
keyword: freq=noraman
keyword: PBEPBE/SDD
title: #p freq=noraman PBEPBE/SDD
converged: YES YES NO NO
title: Mulliken charges:
elementType: O O O O O O N N N C C C C C C C C C H H H H H H H H H H H H H
charge: -0.278468 -0.434897 -0.430593 -0.430907 -0.237591 -0.202455 -0.237645 0.109404 -0.397936 -0.190422 -0.093991 -0.067118 -0.448084 0.036134 -0.353137 0.278535 -0.347447 0.169152 0.271926 0.183024 0.215638 0.269693 0.235544 0.250984 0.204560 0.232271 0.335158 0.357631 0.354686 0.372355 0.273997
chargesum: 0.00000
title: Mulliken charges with hydrogens summed into heavy atoms:
elementType: O O O O O O N N N C C C C C C C C C
charge: -0.278468 -0.099739 -0.072962 -0.076221 -0.237591 -0.202455 -0.237645 0.109404 -0.025581 0.081504 0.089033 0.148520 0.057154 0.287118 0.083694 0.278535 -0.073450 0.169152
polarizability: 1.89721810e+02 4.66187982e-02 1.13979595e+02 1.54327156e+01 1.40641046e+01 1.14654593e+02
1716.lowfreq: -8.5016 -5.3264 0.0005 0.0009 0.0010 5.6230 29.1280 42.6524 49.0841
frequency: 29.1038 42.6228 49.0816 80.1757 94.2217 130.0181 146.1633 165.4940 176.0871 215.0020 229.6293 232.4279 290.0321 320.1041 332.7147 349.9540 370.4036 392.6210 425.6638 441.4888 449.1181 471.8475 492.1696 502.1868 517.2968 527.8824 572.7739 593.7613 626.4780 695.2697 706.1048 713.0114 779.7943 800.4557 849.7724 863.6193 871.2334 912.9741 941.4626 966.1663 987.0168 1004.5574 1009.2452 1025.2868 1050.6790 1077.5690 1079.3549 1085.5321 1127.1737 1168.8354 1182.7354 1191.1813 1199.1283 1243.3206 1244.8419 1253.5725 1279.2986 1287.1135 1311.7725 1317.9048 1321.9564 1333.5865 1344.8858 1353.9257 1359.4384 1364.4160 1382.7391 1385.3618 1392.5017 1461.0643 1462.1706 1534.8876 1645.9454 1665.2096 2882.0464 2917.2688 2973.4426 3005.1181 3029.5533 3065.3997 3098.5390 3105.6268 3191.9090 3512.7972 3522.4869 3524.9003 3548.8818
redmass: 7.8193 8.5724 5.8181 5.1261 7.0795 4.2912 4.6022 8.1183 3.3825 7.9018 4.2045 5.4330 4.6854 2.3056 1.3294 5.6502 10.2934 6.2825 4.4926 1.7033 2.1295 1.2222 6.6312 2.5765 4.3378 4.8454 4.6586 4.1794 4.1508 5.8733 3.1334 4.8105 1.8681 2.6918 4.4947 1.5292 2.3406 3.4045 3.7058 5.6585 2.8676 3.2009 4.0826 3.2036 2.6423 2.5657 2.9643 2.8579 2.2716 1.7308 1.4142 2.1864 1.4926 2.5535 1.4591 1.3064 1.2689 1.3390 1.6331 3.3676 1.3462 1.3385 1.2509 1.3227 1.2767 1.5451 1.3001 1.6736 1.5845 1.0848 1.0863 10.3707 7.7939 7.3785 1.0821 1.0824 1.0687 1.0847 1.0621 1.0859 1.0952 1.1011 1.0934 1.0774 1.0654 1.0656 1.0656
irintensity: 0.2896 0.3776 0.8888 5.9021 2.7066 1.7125 0.2990 7.8958 2.0705 1.9429 2.0709 16.6995 5.7834 27.6812 47.2966 1.6857 24.8887 1.5027 13.1816 97.7113 90.9981 129.7026 1.0962 66.1891 19.6135 33.3207 17.5697 29.6628 7.8297 1.7654 23.0701 14.9807 92.9085 33.1018 4.1583 38.7017 52.9760 54.7292 9.4521 122.0073 129.7003 105.7433 34.8733 32.1125 70.6567 14.9460 5.9456 15.1424 9.9375 10.1826 2.6757 24.0201 20.4059 117.7110 35.4266 13.2234 80.1876 17.3257 83.2217 116.9789 11.9264 26.9077 2.2906 11.1509 21.6352 3.0663 34.5479 15.6579 34.3178 9.1475 6.4949 20.9421 359.2399 475.9475 51.0422 44.8668 51.3959 8.6861 10.1991 13.0111 15.6946 8.9460 0.1690 64.9819 23.6680 1.7059 8.8415
temp: 298.150 k
press: 1.00000 atm
elementType: 8 8 8 8 8 8 7 7 7 6 6 6 6 6 6 6 6 6 1 1 1 1 1 1 1 1 1 1 1 1 1
symmnumber: 1
zpe: 615350.5 jmol-1
zpe.correction: 0.234375 hartree
zpe.thermalcorrener: 0.251406 hartree
zpe.thermalcorrenthalpy: 0.252350 hartree
zpe.thermalcorrgfe: 0.188861 hartree
zpe.sumelectzpe: -964.942663 hartree
zpe.sumelectthermal: -964.925632 hartree
zpe.sumelectthermalent: -964.924687 hartree
zpe.sumelectthermalfe: -964.988176 hartree
dipole: 1.4895 -1.4540 1.4007
dipole: 2.5089
quadrupole: -114.6813 -121.4781 -105.0961
quadrupole: -2.4457 2.8320 -2.1021
quadrupole: -0.9295 -7.7263 8.6558 -2.4457 2.8320 -2.1021
hfenergy: -965.1770377 hartree
pointgroup: C01 [X(C9H13N3O6)]
dipole: 0.5485649 -0.7936014 0.2087108 debye
polarizability: 188.9556657|-11.5663437|103.2965797|13.5442472|6.7930686|126.1037527 unknown
InChI: InChI=1S/C9H13N3O6/c13-3-5-8(16)4(14)1-7(18-5)12-9(17)11-6(15)2-10-12/h2,4-5,7-8,11,13-14,16H,1,3H2
charge 0 multiplicity 1
31 atoms
O  0.893613 0.826788 0.131222
O  4.490893 -0.351488 -0.13914
O  2.961531 -2.567855 -1.274036
O  2.201565 3.128295 1.24071
O  -1.619962 -0.011501 2.392305
O  -5.07237 0.646328 -0.715578
N  -1.181926 -0.280451 0.084827
N  -1.585749 -0.251304 -1.238133
N  -3.345109 0.306956 0.836726
C  3.048644 -0.239909 -0.444844
C  2.379486 -1.624848 -0.324156
C  2.341779 0.791791 0.459864
C  0.873003 -1.53914 -0.61408
C  0.247757 -0.493988 0.320476
C  2.823736 2.232945 0.267471
C  -2.021439 0.010283 1.204316
C  -2.846053 0.042633 -1.50325
C  -3.869265 0.359634 -0.484122
H  3.025428 0.088438 -1.498697
H  2.54097 -1.984487 0.722975
H  2.458949 0.504829 1.532299
H  0.713574 -1.248448 -1.665183
H  0.405931 -2.527647 -0.455795
H  0.347558 -0.788689 1.384242
H  2.606091 2.548235 -0.77493
H  3.908977 2.297298 0.443544
H  4.605205 -0.533151 0.830863
H  3.94855 -2.458775 -1.232928
H  1.218686 3.020085 1.159572
H  -3.988162 0.514797 1.609111
H  -3.14159 0.050947 -2.554751
