program: Gaussian 09
title: 000266023
version: EM64L-G09RevD.01
frameworkgroup: C1[X(C17H16N2)]
method: RPBEPBE
basis: SDD
operation: Freq
keyword: #pfreq=noraman
keyword: PBEPBE/SDD
title: #p freq=noraman PBEPBE/SDD
converged: YES YES NO NO
title: Mulliken charges:
elementType: N N C C C C C C C C C C C C C C C C C H H H H H H H H H H H H H H H H
charge: -0.480075 0.023687 0.058672 0.205096 0.011345 0.174103 0.183083 0.168329 0.155866 -0.562466 0.201696 -0.504223 -0.854568 -0.479613 -0.835727 -0.349423 -0.384429 -0.284442 -0.212391 0.229562 0.211561 0.311764 0.230275 0.218054 0.236477 0.234532 0.239248 0.229831 0.240329 0.220692 0.242680 0.240841 0.233336 0.222664 0.223634
chargesum: 0.00000
title: Mulliken charges with hydrogens summed into heavy atoms:
elementType: N N C C C C C C C C C C C C C C C C C
charge: -0.168311 0.023687 0.058672 0.205096 0.011345 0.174103 0.183083 0.168329 0.155866 -0.121343 0.201696 -0.055895 -0.144311 -0.249782 -0.132025 -0.108582 -0.151093 -0.061778 0.011243
polarizability: 3.43660207e+02 -5.60371293e-01 2.08224182e+02 6.10958619e-01 -1.93116968e+00 9.43133132e+01
1716.lowfreq: -10.1124 -2.1029 0.0001 0.0003 0.0007 8.4134 30.8037 55.1255 84.6143
frequency: 30.6760 55.1173 84.6012 109.6886 117.8982 139.7138 159.4980 185.5300 239.3440 277.4320 287.1938 297.8067 323.5747 338.0106 366.3341 380.7219 432.0425 458.5247 470.6410 482.6390 494.0670 528.3116 560.6504 581.5167 590.0952 609.9401 637.4851 666.9775 672.5859 729.8683 751.4873 759.9471 773.0692 802.5835 827.5639 854.0019 856.0266 888.6516 916.5051 933.5007 936.0652 974.0824 1001.9000 1019.4302 1021.3069 1036.0924 1038.0545 1045.9667 1058.8894 1064.3471 1109.5662 1116.8981 1158.5397 1175.4021 1182.5139 1229.2010 1235.9240 1260.6080 1300.6636 1307.8554 1325.2451 1345.6493 1352.1452 1360.9308 1380.3871 1400.1667 1402.3186 1413.3818 1419.9665 1446.2794 1449.2411 1455.3695 1466.9736 1477.4204 1480.4534 1482.2265 1494.0140 1503.6837 1567.1054 1582.8486 1593.5558 1617.8775 1630.1874 2951.3273 2961.1179 2965.3955 2975.2426 3031.5656 3045.6168 3050.3417 3051.1190 3084.2919 3107.3864 3110.8287 3126.9479 3139.4806 3156.9229 3174.6675 3616.6347
redmass: 1.1218 3.7634 3.2013 2.6357 2.9166 2.8410 4.3613 1.2212 2.8779 4.1884 2.9383 4.0278 3.3918 4.6188 3.7321 4.0780 3.0451 3.6595 5.4687 1.6896 1.8286 4.5566 4.2956 4.3560 4.2119 4.4018 4.8734 3.9695 4.9042 2.9411 1.4161 3.5892 3.2995 3.7854 2.9033 4.0926 1.5389 3.3019 1.6592 3.1021 1.3896 1.3070 2.1925 3.7062 2.0910 1.5471 1.5877 2.0575 2.0779 2.3246 2.3118 2.5200 1.6715 1.1896 1.4330 1.3391 1.5395 2.2161 2.6016 1.4690 3.3603 2.1224 2.5717 1.9385 1.9500 1.2443 1.1931 3.0556 3.2837 1.3980 1.8517 1.1122 1.3766 1.4728 1.7865 1.2747 1.1698 2.1832 8.1123 6.3535 7.0775 7.0368 7.7383 1.0702 1.0646 1.0414 1.0406 1.0975 1.0968 1.0905 1.0963 1.0894 1.0941 1.0926 1.0856 1.0904 1.0959 1.0970 1.0799
irintensity: 0.6486 0.2521 1.4909 1.5522 3.0780 0.5362 0.4119 1.8911 1.6371 2.6506 1.1340 0.1497 2.6949 3.0782 1.8718 1.1867 5.2662 1.7678 0.1718 31.7529 60.6742 12.5417 2.5598 1.2106 12.4567 0.5965 0.5208 2.0149 0.3334 6.7801 86.2245 10.3773 15.1800 3.0764 3.0747 2.7601 0.7080 12.2150 7.1951 4.8748 2.3138 0.0994 3.0076 29.4239 10.1299 5.8544 2.5382 5.5694 0.8151 1.5728 14.1416 2.8375 6.2273 1.2976 0.9591 10.0684 2.5787 3.8500 26.2428 11.1907 3.6163 155.8614 8.1798 22.5736 1.4568 24.6556 4.0509 9.0400 6.7650 1.2534 20.6293 6.3960 20.1010 6.1473 4.9272 27.3564 12.1675 38.2077 78.9980 0.7130 22.9185 23.2080 13.6566 35.1724 47.8345 40.0624 23.6341 21.3848 18.2929 60.6629 22.6087 30.2739 25.9392 21.8405 0.5699 13.8404 33.8390 22.6009 46.7497
temp: 298.150 k
press: 1.00000 atm
elementType: 7 7 6 6 6 6 6 6 6 6 6 6 6 6 6 6 6 6 6 1 1 1 1 1 1 1 1 1 1 1 1 1 1 1 1
symmnumber: 1
zpe: 748512.1 jmol-1
zpe.correction: 0.285093 hartree
zpe.thermalcorrener: 0.300902 hartree
zpe.thermalcorrenthalpy: 0.301846 hartree
zpe.thermalcorrgfe: 0.241996 hartree
zpe.sumelectzpe: -765.614784 hartree
zpe.sumelectthermal: -765.598975 hartree
zpe.sumelectthermalent: -765.598031 hartree
zpe.sumelectthermalfe: -765.657881 hartree
dipole: 3.0033 0.7848 0.0316
dipole: 3.1043
quadrupole: -123.7107 -90.9513 -116.4201
quadrupole: 8.1428 0.0384 -0.5901
quadrupole: -13.3500 19.4094 -6.0594 8.1428 0.0384 -0.5901
hfenergy: -765.8998772 hartree
pointgroup: C01 [X(C17H16N2)]
dipole: 1.1779364 0.322634 -0.0041088 debye
polarizability: 343.6266662|1.0016311|208.2205976|-2.7179564|-2.1900998|94.3504384 unknown
InChI: InChI=1S/C17H16N2/c1-10-12-7-8-18-9-14(12)11(2)17-16(10)13-5-3-4-6-15(13)19-17/h3-6,9,19H,7-8H2,1-2H3
charge 0 multiplicity 1
35 atoms
N  1.412609 1.774912 -0.003672
N  -4.610256 0.240671 0.15827
C  0.523937 -0.353534 -0.048076
C  -1.860182 -0.837762 -0.078874
C  0.210466 1.045213 -0.03188
C  -0.527927 -1.316651 -0.084166
C  -2.146562 0.579155 -0.07402
C  -1.107395 1.552188 -0.04994
C  1.982414 -0.459157 -0.024894
C  -3.07514 -1.762507 -0.14277
C  2.497677 0.888167 0.000946
C  -4.293227 -1.152823 0.583883
C  -0.176661 -2.79214 -0.150983
C  -3.570909 0.990655 -0.126667
C  -1.324958 3.056617 -0.026418
C  2.907834 -1.535565 -0.017509
C  3.879016 1.17182 0.02764
C  4.290877 -1.260155 0.010034
C  4.771343 0.078926 0.031368
H  -3.345716 -1.940635 -1.205808
H  -2.856832 -2.750073 0.299072
H  1.482348 2.789225 0.00202
H  -5.193551 -1.769222 0.415287
H  -4.1104 -1.133865 1.680309
H  0.364468 -3.115337 0.759395
H  -1.060972 -3.437276 -0.261652
H  0.487944 -2.994615 -1.01192
H  -3.801315 2.022078 -0.428652
H  -1.0839 3.516538 -1.005498
H  -0.675894 3.536327 0.732281
H  -2.358879 3.3356 0.224546
H  2.563679 -2.573116 -0.030456
H  4.251705 2.201891 0.046414
H  5.007929 -2.088118 0.015555
H  5.851028 0.26457 0.052435
