program: Gaussian 09
title: 000266046
version: EM64L-G09RevD.01
frameworkgroup: C1[X(C18H17NO4)]
method: RPBEPBE
basis: SDD
operation: Freq
keyword: #p
keyword: freq=noraman
keyword: PBEPBE/SDD
title: #p freq=noraman PBEPBE/SDD
converged: YES YES NO NO
title: Mulliken charges:
elementType: O O O O N C C C C C C C C C C C C C C C C C C H H H H H H H H H H H H H H H H H
charge: -0.297519 -0.277191 -0.288711 -0.210702 0.038422 0.252311 0.260112 -0.026944 0.211029 -0.248143 -0.287759 -0.048603 -0.730188 -0.698397 0.187289 0.236210 -0.547804 0.075553 -0.112956 -0.342734 -0.195314 -0.524012 -0.523520 0.228520 0.277327 0.207688 0.231717 0.236606 0.231211 0.215045 0.245634 0.294643 0.254793 0.264832 0.260843 0.214692 0.230170 0.240433 0.236660 0.228757
chargesum: 0.00000
title: Mulliken charges with hydrogens summed into heavy atoms:
elementType: O O O O N C C C C C C C C C C C C C C C C C C
charge: -0.297519 -0.277191 -0.288711 -0.210702 0.038422 0.252311 0.260112 -0.026944 0.211029 -0.019623 -0.010432 -0.048603 -0.054177 -0.006508 0.187289 0.236210 -0.253162 0.075553 -0.112956 -0.087942 0.069518 0.181694 0.182330
polarizability: 3.72120910e+02 5.81392973e+00 2.40382777e+02 3.21692996e+00 6.90717875e+00 1.14731829e+02
1716.lowfreq: -3.1152 -0.5237 -0.0008 -0.0005 0.0008 7.4272 31.3618 46.9058 65.7858
frequency: 31.3337 46.8750 65.7828 77.8438 85.4494 96.8661 143.3593 148.6463 165.1155 180.7219 201.4858 219.0592 231.4196 243.9466 249.5730 259.6737 264.7206 277.6895 299.2359 320.2778 342.3826 358.2824 364.6256 387.4183 402.9941 444.7534 480.3316 487.7847 499.5678 525.3647 563.3958 572.5576 574.2045 619.6743 630.1721 646.7619 659.3748 691.6817 716.2987 726.2856 729.6274 759.9368 790.1584 795.0805 815.4020 851.3013 852.9367 880.4698 892.2321 902.6137 920.5482 925.3569 948.1742 960.8664 985.1785 997.1736 1016.3577 1033.4348 1067.9934 1109.7691 1110.6717 1112.7502 1128.4009 1143.0759 1149.5478 1160.3362 1173.6507 1184.0007 1198.6523 1233.7096 1243.2154 1264.5404 1293.3207 1320.1671 1322.0050 1370.4327 1374.5066 1379.2837 1395.4259 1405.6831 1419.7551 1438.2564 1446.5351 1452.4950 1457.5792 1460.4089 1469.6170 1470.6557 1479.9456 1482.2889 1483.7460 1489.9433 1523.0097 1547.1872 1592.2056 1611.5642 1636.1569 2976.6857 2980.9768 2986.0040 2994.1195 3083.3249 3084.7063 3084.9991 3094.7077 3095.4964 3102.9517 3125.7690 3128.7001 3134.1981 3189.2321 3207.1304 3238.0425 3266.5492
redmass: 3.9349 3.5935 3.4885 3.8052 2.1179 4.6634 1.6470 3.2640 3.2194 4.6001 1.0276 3.6530 5.1949 4.4488 1.1276 3.2427 4.2976 1.1336 4.4708 3.7334 3.3486 5.9442 4.3977 5.0201 4.1896 5.1385 4.2250 3.7379 6.3225 6.9958 5.3767 5.6990 4.7625 6.2875 4.6965 6.9824 5.6307 5.0245 2.5064 6.3018 1.4815 3.2995 5.0724 4.6515 6.1558 1.3553 4.6842 4.4065 1.6475 5.9667 1.5655 5.1486 1.7689 1.3950 3.9874 1.3224 4.1783 3.7365 5.0499 1.3215 1.3593 2.5022 1.7612 1.4333 1.8390 1.6413 1.7546 1.7154 2.6556 2.5003 2.3509 5.6196 2.8939 6.2661 2.5355 3.2820 1.4576 2.0666 1.3304 4.8653 1.7046 1.3648 2.0334 1.0549 1.1191 1.0557 1.0938 1.0544 1.0503 1.0570 1.0649 5.4792 6.2170 7.9918 9.4136 9.3983 7.6550 1.0342 1.0309 1.0347 1.0355 1.1053 1.0988 1.0987 1.0992 1.1009 1.1007 1.1017 1.1045 1.0904 1.0926 1.0943 1.0899 1.1080
irintensity: 0.5525 2.0205 2.5807 5.9457 4.5506 0.5407 3.5934 1.7730 4.0523 3.0397 0.0520 0.7194 1.1573 3.3965 0.6316 1.8087 5.4017 0.2113 3.8454 9.8431 0.6054 3.3026 5.3892 3.1213 2.8790 0.2907 2.5504 0.8831 1.7036 1.7284 3.8986 1.7422 3.3311 0.5135 0.9827 22.7675 10.1839 18.5432 53.2708 9.7442 29.0883 18.5513 3.4270 8.4406 5.3291 0.3189 20.1031 35.5645 17.2903 32.7066 2.5058 43.7937 8.0685 4.5029 4.1130 0.7427 15.2863 111.8234 69.1129 22.4123 10.4205 71.8553 105.9677 32.6947 49.9916 31.9108 46.0821 28.3932 50.9235 50.2755 22.2010 126.6717 16.0708 166.6978 40.3920 24.3985 20.4378 90.1332 8.0294 106.3018 3.8402 15.2701 3.1811 4.4723 8.7658 2.3265 6.4721 16.3563 25.9044 15.7672 18.8935 37.2768 69.4188 86.4292 116.1346 1.3308 25.3576 104.4791 51.0524 14.6257 26.2985 30.2124 17.1472 18.5374 25.6863 19.1866 30.4043 18.0413 18.5811 7.8295 1.9870 9.1233 7.2547 2.7170
temp: 298.150 k
press: 1.00000 atm
elementType: 8 8 8 8 7 6 6 6 6 6 6 6 6 6 6 6 6 6 6 6 6 6 6 1 1 1 1 1 1 1 1 1 1 1 1 1 1 1 1 1
symmnumber: 1
zpe: 811881.1 jmol-1
zpe.correction: 0.309229 hartree
zpe.thermalcorrener: 0.329934 hartree
zpe.thermalcorrenthalpy: 0.330878 hartree
zpe.thermalcorrgfe: 0.260637 hartree
zpe.sumelectzpe: -1050.057138 hartree
zpe.sumelectthermal: -1050.036433 hartree
zpe.sumelectthermalent: -1050.035488 hartree
zpe.sumelectthermalfe: -1050.105730 hartree
dipole: -0.4372 -6.5015 -1.1105
dipole: 6.6101
quadrupole: -108.2130 -128.5101 -136.0086
quadrupole: -15.0384 1.1282 -4.3239
quadrupole: 16.0309 -4.2662 -11.7647 -15.0384 1.1282 -4.3239
hfenergy: -1050.3663668 hartree
pointgroup: C01 [X(C18H17N1O4)]
dipole: -0.3279136 -2.5124509 -0.5858557 debye
polarizability: 371.6415122|-4.1224702|239.1364901|13.3343789|13.2161809|116.4575131 unknown
InChI: InChI=1S/C18H17NO4/c1-18(2)7-5-10-14-12(9-13(20-3)15(10)23-18)19-17-11(6-8-22-17)16(14)21-4/h5-9H,1-4H3
charge 0 multiplicity 1
40 atoms
O  -3.168065 0.309206 -0.355214
O  -2.429401 2.98344 0.190739
O  1.368082 -2.316321 -0.462601
O  4.514928 1.251578 0.342473
N  2.201578 1.836857 0.268062
C  -3.604993 -1.118507 -0.081863
C  -0.805813 -0.393886 -0.39597
C  -1.804351 0.599751 -0.230757
C  0.59021 -0.040225 -0.20778
C  -2.61467 -2.044052 -0.763977
C  -1.296003 -1.70723 -0.851608
C  0.910605 1.358418 0.074121
C  -5.011901 -1.199318 -0.691067
C  -3.624595 -1.317625 1.450271
C  -1.469671 1.979351 0.000312
C  1.696085 -0.976944 -0.249119
C  -0.131003 2.32916 0.152028
C  3.014423 -0.497643 -0.06338
C  3.144695 0.919161 0.181366
C  4.376893 -1.026903 -0.046006
C  5.217368 0.036262 0.193884
C  -3.441863 3.176423 -0.870461
C  2.391652 -3.361909 -0.351474
H  -2.989945 -2.991383 -1.167443
H  -0.579967 -2.392373 -1.303506
H  -5.438992 -2.203986 -0.521204
H  -5.676991 -0.453726 -0.222463
H  -4.976303 -1.01029 -1.777308
H  -4.310231 -0.592716 1.924091
H  -3.965125 -2.340932 1.691824
H  -2.614432 -1.184423 1.874025
H  0.142291 3.366599 0.355396
H  4.716009 -2.047294 -0.196058
H  6.297278 0.114862 0.286081
H  -4.051693 2.268801 -1.005624
H  -2.947517 3.450146 -1.822513
H  -4.062099 4.014337 -0.517981
H  1.833926 -4.306982 -0.429438
H  2.905751 -3.311226 0.624797
H  3.121447 -3.292657 -1.178057
