program: Gaussian 09
title: 000266036
version: EM64L-G09RevD.01
frameworkgroup: C1[X(C18H16O4)]
method: RPBEPBE
basis: SDD
operation: Freq
keyword: #pfreq=noraman
keyword: PBEPBE/SDD
title: #p freq=noraman PBEPBE/SDD
converged: YES YES NO NO
title: Mulliken charges:
elementType: O O O O C C C C C C C C C C C C C C C C C C H H H H H H H H H H H H H H H H
charge: -0.401901 -0.413444 -0.230677 -0.232254 -0.348031 -0.300098 -0.296075 -0.264658 0.567899 0.438680 0.137426 0.143460 -0.442411 -0.437485 -0.415048 -0.390981 -0.231939 -0.236251 -0.241419 -0.236574 -0.243766 -0.243099 0.272031 0.277151 0.321797 0.334514 0.236577 0.266118 0.239686 0.243016 0.378929 0.380395 0.227640 0.226498 0.227639 0.226621 0.231127 0.228907
chargesum: 0.00000
title: Mulliken charges with hydrogens summed into heavy atoms:
elementType: O O O O C C C C C C C C C C C C C C C C C C
charge: -0.022971 -0.033049 -0.230677 -0.232254 -0.076000 -0.022947 0.025722 0.069856 0.567899 0.438680 0.137426 0.143460 -0.205833 -0.171367 -0.175362 -0.147965 -0.004299 -0.009754 -0.013780 -0.009953 -0.012639 -0.014193
polarizability: 2.39780172e+02 1.62287202e+01 2.03019696e+02 -1.71417499e+01 1.42373736e+01 1.53201525e+02
1716.lowfreq: -0.0005 -0.0003 0.0005 2.6660 5.0888 7.7619 20.9157 25.8781 34.2106
frequency: 20.8391 25.7927 34.1338 36.7158 43.9917 53.5679 65.1954 83.1026 95.1236 155.7821 179.1173 188.7306 241.6645 252.5821 260.8712 290.0959 369.3176 403.1588 404.9709 409.4713 435.5904 475.7047 514.1232 529.4056 587.2294 592.5634 599.7682 614.3680 617.3420 627.7400 629.4618 631.4783 699.3567 705.0905 707.8344 718.6270 753.3995 774.7037 819.5847 826.9333 854.1722 859.8941 915.2785 920.8517 923.2292 956.4861 959.9140 979.1025 982.3638 988.7138 990.2911 996.7527 997.3660 1001.2315 1017.0539 1027.5883 1029.9621 1036.1393 1058.1753 1081.6304 1089.6786 1108.1548 1140.1432 1173.2953 1173.4018 1187.9427 1192.4795 1193.5002 1199.5303 1221.2902 1223.3764 1232.6245 1240.7728 1252.4978 1297.3718 1316.8150 1328.5777 1344.0794 1351.7410 1377.1074 1385.3278 1409.9582 1435.8036 1445.8126 1486.0226 1487.6194 1589.5167 1591.3590 1613.8354 1615.4661 1650.8726 1656.2422 2992.1803 3033.0486 3076.6819 3087.4925 3115.9611 3117.1524 3120.2721 3125.5885 3133.6515 3136.9448 3145.8279 3146.2687 3162.6488 3164.1519 3502.1807 3505.9354
redmass: 7.9745 6.6106 4.6900 7.5293 4.6456 5.0836 5.7233 6.4063 7.2802 4.8979 4.7672 5.7400 5.5565 7.5076 5.8176 5.8246 4.3699 2.8537 2.8297 4.3171 3.9824 3.9425 4.1444 3.0891 4.1762 3.6677 1.6019 6.1632 5.4026 1.7144 3.0806 3.3495 3.4023 1.9765 1.8665 3.0253 1.7961 2.0352 5.1037 4.0129 1.2492 1.2464 2.1644 2.5146 1.6633 3.9113 3.4896 1.4052 1.3991 5.9486 6.0715 1.3754 1.4739 3.3954 3.9911 3.4998 2.1671 2.3618 1.9993 1.6537 1.6689 2.3482 1.3336 1.0525 1.0561 1.1817 1.1689 1.1777 1.1872 1.4185 1.6728 1.5596 1.4196 1.6102 1.7820 1.6519 1.3446 2.0212 1.4748 7.1535 5.2802 2.1263 2.2565 2.0952 2.3503 2.3291 6.0132 5.8815 6.0563 5.9169 8.4873 8.3987 1.0831 1.0857 1.0867 1.0855 1.0877 1.0873 1.0849 1.0874 1.0903 1.0921 1.0956 1.0964 1.1016 1.1014 1.0639 1.0639
irintensity: 1.0762 1.5500 0.1898 1.0688 0.1610 0.0227 0.6212 0.9510 0.0109 0.1098 1.3200 1.4061 1.0417 2.0723 0.9843 0.9843 2.7338 0.1530 0.0553 9.4751 1.7070 13.6340 9.5704 56.3011 46.2378 35.7557 159.6765 0.1926 11.5447 46.6769 4.8014 3.0709 54.5955 61.7656 21.9321 34.9229 52.2396 34.9492 0.8683 4.6617 0.1523 0.3866 17.0002 11.4842 4.0899 5.6621 6.0924 0.3529 0.7070 0.6308 0.3090 1.5422 1.5057 5.9040 8.1200 73.0350 22.1964 51.4288 362.8331 22.2850 14.2400 44.5668 4.2640 0.0567 0.5513 26.2479 15.3510 17.4246 14.9505 3.8668 0.2509 3.0066 6.3075 8.9685 25.9130 7.3949 3.6246 70.2483 3.0221 0.2343 5.0051 61.9864 8.5921 14.6737 12.4218 19.4780 1.2411 3.0614 4.0890 11.7664 359.2915 37.2020 4.7629 10.7779 0.9689 3.7720 7.2790 8.4813 2.7232 0.4693 8.1024 12.3524 28.6110 34.1851 29.5094 25.2440 24.1420 26.8905
temp: 298.150 k
press: 1.00000 atm
elementType: 8 8 8 8 6 6 6 6 6 6 6 6 6 6 6 6 6 6 6 6 6 6 1 1 1 1 1 1 1 1 1 1 1 1 1 1 1 1
symmnumber: 1
zpe: 775353.2 jmol-1
zpe.correction: 0.295316 hartree
zpe.thermalcorrener: 0.314707 hartree
zpe.thermalcorrenthalpy: 0.315651 hartree
zpe.thermalcorrgfe: 0.243618 hartree
zpe.sumelectzpe: -994.854941 hartree
zpe.sumelectthermal: -994.835550 hartree
zpe.sumelectthermalent: -994.834606 hartree
zpe.sumelectthermalfe: -994.906639 hartree
dipole: -0.4162 -1.0846 0.1808
dipole: 1.1757
quadrupole: -112.9481 -118.9869 -131.6732
quadrupole: 4.5306 6.0979 2.1778
quadrupole: 8.2547 2.2158 -10.4705 4.5306 6.0979 2.1778
hfenergy: -995.1502573 hartree
pointgroup: C01 [X(C18H16O4)]
dipole: 0.1601088 0.4313852 0.0473303 debye
polarizability: 238.8164983|17.8963061|201.2176605|18.0165625|-16.8028137|155.967234 unknown
InChI: InChI=1S/C18H16O4/c19-17(20)15-13(11-7-3-1-4-8-11)14(16(15)18(21)22)12-9-5-2-6-10-12/h1-10,13-16,19,21H
charge 0 multiplicity 1
38 atoms
O  2.159006 -3.265417 -1.071217
O  -2.809067 -2.737164 1.189827
O  0.262008 -2.780188 -2.322475
O  -0.846248 -2.596541 2.424999
C  0.646695 -0.171909 -0.403867
C  -0.695396 -0.028511 0.423421
C  0.570384 -1.732789 -0.117206
C  -0.951348 -1.570891 0.192601
C  1.881157 0.59231 0.011503
C  -1.73565 0.977561 -0.024942
C  0.930337 -2.626295 -1.274042
C  -1.476121 -2.342895 1.372591
C  2.553269 1.422708 -0.922288
C  -3.0970 0.614911 -0.183143
C  2.389982 0.509607 1.335413
C  -1.352577 2.323544 -0.268431
C  3.702923 2.153475 -0.548056
C  -4.054969 1.576444 -0.579383
C  3.538357 1.238037 1.712358
C  -2.309109 3.282953 -0.665316
C  4.199574 2.063585 0.772224
C  -3.665681 2.913027 -0.822449
H  0.420267 0.00641 -1.471033
H  -0.434335 0.133968 1.48818
H  1.144843 -2.004063 0.781834
H  -1.565481 -1.747734 -0.704352
H  2.172423 1.493264 -1.949008
H  -3.413324 -0.417845 0.004221
H  1.891744 -0.128896 2.075993
H  -0.303442 2.619007 -0.146499
H  2.383477 -3.81108 -1.874251
H  -3.127759 -3.214255 2.004339
H  4.210008 2.788793 -1.282892
H  -5.103527 1.280779 -0.698455
H  3.919747 1.162274 2.736809
H  -1.997763 4.31723 -0.851067
H  5.09174 2.627825 1.065735
H  -4.408346 3.657055 -1.131473
