program: Gaussian 09
title: 000266037
version: EM64L-G09RevD.01
frameworkgroup: C1[X(C17H17NO5)]
method: RPBEPBE
basis: SDD
operation: Freq
keyword: #p
keyword: freq=noraman
keyword: PBEPBE/SDD
title: #p freq=noraman PBEPBE/SDD
converged: YES YES NO NO
title: Mulliken charges:
elementType: O O O O O N C C C C C C C C C C C C C C C C C H H H H H H H H H H H H H H H H H
charge: -0.286312 -0.293472 -0.351163 -0.445675 -0.262940 -0.231841 0.202622 0.224168 0.195444 0.183992 0.049848 0.017569 -0.121383 0.079383 0.147978 -0.640455 -0.341929 -0.364051 -0.236532 -0.264465 -0.512836 -0.526325 -0.479061 0.243111 0.271296 0.231340 0.253186 0.280365 0.226648 0.231827 0.392176 0.273618 0.210401 0.222044 0.205898 0.282079 0.225853 0.229612 0.253560 0.224419
chargesum: 0.00000
title: Mulliken charges with hydrogens summed into heavy atoms:
elementType: O O O O O N C C C C C C C C C C C C C C C C C
charge: -0.286312 -0.293472 -0.351163 -0.053498 -0.262940 -0.231841 0.202622 0.224168 0.195444 0.183992 0.049848 0.017569 -0.121383 0.079383 0.147978 0.105291 -0.088743 -0.083685 -0.009884 -0.032639 0.193227 0.187504 0.228530
polarizability: 3.46863145e+02 1.22692785e+00 2.45660637e+02 -6.63259835e+00 -1.02230749e+00 1.07365662e+02
1716.lowfreq: -45.6694 -8.0862 -0.6553 0.0004 0.0006 0.0008 8.7598 26.2068 47.3164
frequency: -45.6617 26.1656 47.3064 72.1419 100.5470 106.5454 111.8718 125.3864 134.2197 156.5711 164.9353 167.9124 175.4761 180.5349 204.3218 233.1389 254.4878 265.8346 288.6134 310.7817 316.7019 329.6970 342.2980 349.5320 385.5372 388.8134 409.7087 440.7649 447.6471 469.1952 485.7785 522.6269 529.9134 531.6235 541.1668 601.8725 614.9301 656.4864 680.4033 701.9694 720.5444 749.8835 764.0278 778.8211 822.0313 827.8820 860.6075 868.0045 883.8835 924.2305 965.3349 981.4888 994.3807 1019.3192 1041.2414 1050.2439 1090.2182 1099.0586 1105.9163 1109.4647 1111.9609 1114.1788 1129.5971 1152.2451 1154.5362 1159.4404 1173.2928 1181.7094 1212.1409 1245.1941 1270.1991 1290.2700 1325.1350 1333.3781 1379.8448 1399.7481 1403.3348 1408.6459 1427.9353 1428.8732 1447.5291 1448.7669 1451.0048 1452.6242 1454.2406 1463.5960 1466.9490 1477.3900 1482.8285 1484.7641 1488.5641 1494.9321 1533.4238 1557.1516 1587.5814 1599.6053 1621.8082 2967.0866 2977.0457 2996.9992 3001.8017 3079.4036 3081.3581 3091.0004 3109.7928 3122.4664 3126.7585 3131.4888 3132.3943 3148.5860 3160.0933 3164.3532 3173.6711 3439.1703
redmass: 2.8751 4.8163 4.7945 4.2517 2.9616 2.4862 3.0179 1.6686 1.3608 1.8970 3.2514 2.9004 1.3835 3.0480 1.2751 3.8801 5.1369 4.4638 6.4143 6.7110 5.8324 5.6229 6.4971 6.3053 6.1780 5.2904 3.6363 3.9152 7.1371 6.3976 6.8534 6.7913 2.4788 1.5523 3.9458 6.2302 6.8902 6.0569 8.2030 4.8747 6.0149 5.9736 1.7267 3.2242 6.9741 6.3935 7.0159 1.5320 7.0938 6.6639 1.3639 9.2393 1.3318 6.1358 2.1405 6.3453 4.1186 1.2859 1.6149 1.3506 1.3637 1.7039 1.6505 1.3582 1.3936 1.5188 1.2569 1.7916 3.7537 2.1599 1.8000 3.3416 3.7650 4.6414 3.5968 2.2289 5.1028 1.9136 1.5269 1.4822 1.2723 1.0991 1.1301 1.3027 1.3839 1.7867 1.0490 1.0804 2.4980 1.0627 1.0610 1.4038 10.0294 8.4780 8.0724 7.4785 6.7748 1.0357 1.0313 1.0378 1.0291 1.1029 1.0955 1.1016 1.1040 1.1041 1.1051 1.0861 1.1061 1.0896 1.0966 1.0951 1.0983 1.0634
irintensity: 4.7625 4.6124 0.1767 0.7360 3.0513 1.0877 1.3059 1.0556 0.4775 1.8382 3.3082 3.8909 0.0509 0.4801 1.7431 7.0313 0.6534 15.1741 2.0363 5.5271 1.1333 1.6133 11.5559 2.1952 4.1649 1.0565 0.9310 3.0209 6.0888 10.9465 7.9490 6.3242 38.7466 81.4624 3.7311 11.5508 16.7453 14.6702 6.7179 3.4480 14.8580 16.6558 75.9041 30.7141 2.4716 16.5336 4.3423 0.9035 9.4216 32.7583 1.8690 101.6854 1.4391 59.5037 77.0777 105.8384 21.4509 25.5407 35.0233 6.8699 37.2904 82.6745 37.1755 9.0099 5.5497 51.9664 9.7306 8.1023 41.3041 108.4501 81.7833 30.6093 195.2122 88.5426 153.7003 15.8014 15.0739 74.7863 75.1541 66.1795 42.6778 10.3937 46.1670 6.8123 67.5974 45.4250 25.0206 59.1631 22.5425 8.1661 11.2227 64.9181 248.0403 26.1612 65.4610 247.2828 32.5544 94.9088 91.6550 57.4187 85.0930 21.5267 33.4019 19.6122 34.3047 16.0242 14.1231 7.0106 18.6884 7.7700 4.7139 16.1558 26.6092 110.7692
temp: 298.150 k
press: 1.00000 atm
elementType: 8 8 8 8 8 7 6 6 6 6 6 6 6 6 6 6 6 6 6 6 6 6 6 1 1 1 1 1 1 1 1 1 1 1 1 1 1 1 1 1
symmnumber: 1
zpe: 808962.3 jmol-1
zpe.correction: 0.308117 hartree
zpe.thermalcorrener: 0.329290 hartree
zpe.thermalcorrenthalpy: 0.330234 hartree
zpe.thermalcorrgfe: 0.258994 hartree
zpe.sumelectzpe: -1087.160760 hartree
zpe.sumelectthermal: -1087.139587 hartree
zpe.sumelectthermalent: -1087.138643 hartree
zpe.sumelectthermalfe: -1087.209883 hartree
dipole: -2.8621 -3.9335 0.1415
dipole: 4.8666
quadrupole: -104.2595 -130.0727 -133.3915
quadrupole: -3.9041 3.5525 -0.6889
quadrupole: 18.3151 -7.4981 -10.8169 -3.9041 3.5525 -0.6889
hfenergy: -1087.4688773 hartree
pointgroup: C01 [X(C17H17N1O5)]
dipole: 1.1263674 1.548094 0.0262653 debye
polarizability: 345.6062105|1.9077746|245.3480455|18.4966443|-6.5550268|108.9351886 unknown
InChI: InChI=1S/C17H17NO5/c1-18-10-8-6-5-7-9(10)13(19)11-12(18)14(20)16(22-3)17(23-4)15(11)21-2/h5-8,20H,1-4H3
charge 0 multiplicity 1
40 atoms
O  1.587599 -2.424605 0.318427
O  3.782076 -0.763416 0.315491
O  3.306747 2.168746 0.011449
O  0.944994 3.151079 -0.064045
O  -1.192239 -2.615032 0.385331
N  -1.435178 1.540616 0.219575
C  -0.148554 0.951965 0.216957
C  0.003201 -0.487352 0.27234
C  -2.567325 0.768581 -0.097456
C  -2.4711 -0.656037 -0.133403
C  -1.204622 -1.348024 0.202586
C  1.326016 -1.044848 0.308091
C  1.020093 1.757921 0.124782
C  2.48046 -0.223601 0.231697
C  2.314557 1.179865 0.137794
C  -1.655565 2.931351 0.689899
C  -3.827106 1.385193 -0.364824
C  -3.62235 -1.43027 -0.435717
C  -4.949212 0.597155 -0.668823
C  -4.85627 -0.820277 -0.705804
C  1.396882 -3.121144 1.611434
C  4.180463 -1.641942 -0.811535
C  4.747935 1.869899 0.070536
H  -1.763884 3.641348 -0.148667
H  -0.802573 3.256476 1.295456
H  -2.566251 2.951521 1.313081
H  -3.920639 2.474019 -0.370934
H  -3.501291 -2.518409 -0.434919
H  -5.903955 1.088646 -0.888294
H  -5.737456 -1.425408 -0.94168
H  1.886845 3.471601 -0.145855
H  0.323283 -3.152984 1.856958
H  1.989544 -2.620468 2.400315
H  1.773584 -4.141747 1.442501
H  4.188989 -1.069439 -1.760405
H  3.488321 -2.496038 -0.885442
H  5.197905 -1.983482 -0.565875
H  5.061718 1.276657 -0.804774
H  4.998393 1.325059 0.9933
H  5.229261 2.860421 0.051954
