program: Gaussian 09
title: 000266047
version: EM64L-G09RevD.01
frameworkgroup: C1[X(C18H17NO4)]
method: RPBEPBE
basis: SDD
operation: Freq
keyword: #p
keyword: freq=noraman
keyword: PBEPBE/SDD
title: #p freq=noraman PBEPBE/SDD
converged: YES YES NO NO
title: Mulliken charges:
elementType: O O O O N C C C C C C C C C C C C C C C C C C H H H H H H H H H H H H H H H H H
charge: -0.305988 -0.262658 -0.280298 -0.282623 -0.191713 0.248761 0.291802 0.063401 0.313664 -0.042098 -0.241141 -0.309375 0.142916 0.063200 -0.583571 0.147905 0.148963 -0.726306 -0.695133 -0.655649 -0.354181 -0.180279 -0.521262 0.231614 0.313241 0.279289 0.209636 0.238226 0.227979 0.244660 0.218564 0.227040 0.272425 0.245371 0.248567 0.279975 0.264044 0.229111 0.214125 0.267795
chargesum: 0.00000
title: Mulliken charges with hydrogens summed into heavy atoms:
elementType: O O O O N C C C C C C C C C C C C C C C C C C
charge: -0.305988 -0.262658 -0.280298 -0.282623 -0.191713 0.248761 0.291802 0.063401 0.313664 -0.042098 -0.009526 0.003866 0.142916 0.063200 -0.304282 0.147905 0.148963 -0.050465 -0.004869 0.110713 -0.074206 0.083766 0.189769
polarizability: 3.48411858e+02 -1.68500914e+00 2.43191252e+02 -2.64227671e+00 6.22936361e+00 1.14073818e+02
1716.lowfreq: -10.4258 -7.5010 -0.0005 -0.0004 -0.0004 4.9852 37.1351 46.5317 60.8731
frequency: 37.1321 46.5157 60.8659 67.8466 84.2099 115.2276 148.0879 153.7398 176.2326 177.7584 192.2560 195.5976 215.4986 231.9229 234.5772 255.2792 268.5904 285.6048 303.5354 319.9552 345.7054 346.3536 351.5515 376.7480 398.8692 437.8216 470.1527 480.2202 492.9389 519.3415 557.0737 565.7909 581.4061 623.0704 639.5516 649.1259 660.6696 669.8039 703.0123 717.9874 720.5726 761.0133 771.4699 801.1580 817.9498 850.6700 855.8598 865.7462 882.3697 910.4406 916.6821 944.1144 952.1126 969.7912 983.1064 995.1065 997.1951 1043.7230 1094.9473 1108.2648 1112.0007 1119.3084 1127.1096 1154.8064 1156.5950 1169.9973 1171.1841 1200.1993 1220.6612 1235.2692 1248.7017 1266.9629 1310.1527 1356.4183 1370.8115 1372.4167 1375.5333 1390.4434 1406.3325 1426.5101 1437.5910 1448.6179 1451.1536 1457.1555 1457.9708 1467.2851 1468.2898 1480.8620 1481.6843 1482.4912 1492.1261 1518.4085 1535.6635 1565.0494 1596.4366 1633.7856 1641.0076 2980.9579 2984.8673 2990.7695 2992.9876 3072.5869 3084.0197 3091.5238 3093.5938 3094.1343 3102.5783 3131.3525 3133.0524 3133.6620 3180.5299 3186.3986 3235.8542 3280.4809
redmass: 4.8502 3.6909 4.4236 2.1230 3.3209 2.7064 1.9662 3.3801 2.7173 6.0599 1.0405 1.2482 4.4940 2.6025 1.2635 3.8439 3.6552 3.6776 4.3630 5.2077 4.1054 4.6244 4.1604 4.4241 4.2724 5.1405 6.1270 3.1260 6.0272 5.6576 5.8874 3.9918 6.3900 4.2435 5.4179 5.6140 6.7039 4.0373 1.7452 2.4110 4.9087 3.2778 3.9610 4.1850 5.0763 2.2555 3.4574 3.7661 1.3563 6.0066 1.5262 1.8856 3.5111 2.8668 1.4938 1.3680 4.5329 3.5866 1.9481 2.1375 1.2899 1.2969 1.7638 1.5458 1.8522 2.8687 2.0825 2.9647 2.1283 2.5222 2.1405 2.1848 4.4183 3.8496 1.3266 3.7935 3.3537 1.2950 4.3892 1.8265 1.6951 1.3175 1.0572 1.0776 1.0985 3.0805 1.1085 1.0543 1.0460 1.0577 1.3184 6.4483 9.6487 7.7948 7.5320 8.1715 8.0695 1.0346 1.0347 1.0360 1.0353 1.1026 1.0997 1.0971 1.0993 1.1008 1.1007 1.0898 1.0988 1.1052 1.0961 1.0907 1.0932 1.1074
irintensity: 3.1699 0.5008 3.2215 5.5042 1.6806 0.8536 1.3017 3.5357 2.2990 4.4802 0.0769 1.5821 2.0984 2.3429 0.4639 1.0409 6.0506 7.9000 8.4557 2.8635 1.1739 6.0356 2.0308 4.5027 1.8243 2.2989 10.1483 1.1891 0.5539 0.5372 9.4951 5.5466 1.2270 1.1356 4.2742 3.7701 12.3276 29.4120 59.1148 19.2413 0.2656 7.6697 41.3915 8.7556 4.3433 40.6242 8.3028 52.8812 9.1290 15.3137 1.5428 6.9310 18.2765 9.7225 7.0381 1.6786 7.2367 49.5125 122.9122 29.6762 8.9828 0.5822 137.8988 26.9040 10.9839 28.6070 32.5658 24.2167 118.4387 9.8226 35.1906 50.6354 117.9103 19.2372 30.7939 32.1618 22.6327 15.7992 83.5126 37.0749 60.0984 0.9324 4.5851 4.1860 6.5074 55.6513 18.9252 27.3642 16.4806 7.9729 42.5169 85.3329 17.6119 172.2789 245.1862 73.6823 154.5009 93.7882 14.3464 50.0032 26.3675 18.9836 4.4741 31.3689 24.7436 22.5268 30.2212 9.7398 1.4353 11.7253 31.3861 1.2380 5.6478 0.3753
temp: 298.150 k
press: 1.00000 atm
elementType: 8 8 8 8 7 6 6 6 6 6 6 6 6 6 6 6 6 6 6 6 6 6 6 1 1 1 1 1 1 1 1 1 1 1 1 1 1 1 1 1
symmnumber: 1
zpe: 813318.7 jmol-1
zpe.correction: 0.309777 hartree
zpe.thermalcorrener: 0.330607 hartree
zpe.thermalcorrenthalpy: 0.331551 hartree
zpe.thermalcorrgfe: 0.261136 hartree
zpe.sumelectzpe: -1050.082146 hartree
zpe.sumelectthermal: -1050.061317 hartree
zpe.sumelectthermalent: -1050.060372 hartree
zpe.sumelectthermalfe: -1050.130787 hartree
dipole: 0.6356 3.4769 -0.0209
dipole: 3.5345
quadrupole: -106.2727 -131.5044 -135.7855
quadrupole: -9.8444 -2.5038 -3.5816
quadrupole: 18.2482 -6.9835 -11.2647 -9.8444 -2.5038 -3.5816
hfenergy: -1050.3919231 hartree
pointgroup: C01 [X(C18H17N1O4)]
dipole: -0.2263198 1.3718216 -0.0254242 debye
polarizability: 348.3717074|0.1421633|242.8796511|4.819249|-8.6551303|114.4255698 unknown
InChI: InChI=1S/C18H17NO4/c1-18(2)7-5-10-14-12(9-13(21-4)16(10)23-18)19(3)17-11(15(14)20)6-8-22-17/h5-9H,1-4H3
charge 0 multiplicity 1
40 atoms
O  -3.177723 0.309512 -0.005049
O  4.638484 0.453366 -0.084618
O  -2.127963 2.962807 -0.324124
O  1.207155 -2.722037 0.364368
N  2.386212 1.32164 -0.168446
C  -3.696418 -1.054925 -0.422163
C  -0.876593 -0.579504 0.140472
C  0.54573 -0.354326 0.08925
C  1.000334 1.006874 -0.093611
C  -1.788628 0.500534 -0.020731
C  -2.809695 -2.115047 0.205796
C  -1.481519 -1.895262 0.418037
C  -1.312435 1.838324 -0.142964
C  1.525616 -1.487641 0.214288
C  0.070679 2.071612 -0.187971
C  3.258751 0.27572 -0.038617
C  2.915629 -1.063311 0.146363
C  -5.132245 -1.086844 0.121817
C  -3.659391 -1.120089 -1.965846
C  2.873703 2.697961 -0.37297
C  4.171097 -1.788761 0.222814
C  5.18612 -0.870246 0.083859
C  -3.282046 3.149371 0.583414
H  -3.270139 -3.078696 0.45273
H  -0.822231 -2.678598 0.796138
H  0.389715 3.108137 -0.309394
H  -5.619926 -2.037429 -0.159262
H  -5.133135 -1.002156 1.221608
H  -5.722276 -0.254592 -0.299532
H  -2.62472 -1.014979 -2.335109
H  -4.045996 -2.095866 -2.311724
H  -4.280242 -0.316568 -2.400947
H  3.972116 2.678386 -0.413007
H  2.559495 3.352622 0.459472
H  2.48848 3.109673 -1.322554
H  4.273778 -2.862237 0.363281
H  6.270482 -0.909655 0.071504
H  -3.741982 4.094635 0.257999
H  -2.9319 3.240718 1.629415
H  -3.992375 2.31308 0.495718
