program: Gaussian 09
title: 000266000
version: EM64L-G09RevD.01
frameworkgroup: C1[X(C13H11NO2)]
method: RPBEPBE
basis: SDD
operation: Freq
keyword: #p
keyword: freq=noraman
keyword: PBEPBE/SDD
title: #p freq=noraman PBEPBE/SDD
converged: NO YES NO NO
title: Mulliken charges:
elementType: O O N C C C C C C C C C C C C C H H H H H H H H H H H
charge: -0.442795 -0.336587 -0.054489 0.456912 0.443066 -0.288690 -0.499822 -0.421405 -0.392051 -0.357597 0.303201 -0.185155 -0.400024 -0.202648 -0.219229 -0.238267 0.235017 0.243565 0.310316 0.292244 0.248145 0.227184 0.221738 0.234903 0.232714 0.234371 0.355384
chargesum: 0.00000
title: Mulliken charges with hydrogens summed into heavy atoms:
elementType: O O N C C C C C C C C C C C C C
charge: -0.087411 -0.336587 -0.054489 0.456912 0.443066 -0.053672 -0.256257 -0.111089 -0.099807 -0.109452 0.303201 0.042029 -0.178286 0.032254 0.013485 -0.003896
polarizability: 3.11102619e+02 2.21915849e+00 1.56974748e+02 -4.63289521e+00 -3.61875431e+00 6.63658513e+01
1716.lowfreq: -10.9219 -2.6562 -0.0008 -0.0007 0.0005 3.1075 35.1815 46.4445 77.4121
frequency: 35.1626 46.4413 77.4048 94.4545 165.3046 202.4639 231.5837 241.9321 293.4852 332.7163 344.7302 403.2734 409.6739 426.1990 453.9693 489.9034 515.1592 582.1523 588.3122 611.1428 635.6943 665.7247 690.6567 691.0209 750.9281 772.5356 785.6952 802.0639 843.4927 866.4345 881.7778 895.5823 922.5551 932.3373 975.6176 979.0413 986.9810 988.6792 997.0277 1022.1728 1057.6683 1082.9440 1088.7427 1144.6937 1152.1710 1171.2936 1173.4387 1183.8505 1200.5132 1271.7430 1308.1895 1317.6459 1373.1527 1393.1639 1402.9110 1438.3735 1449.6220 1469.2422 1475.2534 1541.3928 1572.7611 1601.0868 1605.0767 1624.6332 3117.7211 3134.5877 3144.9435 3147.9152 3150.9065 3156.8203 3167.9921 3171.1241 3185.3911 3200.1097 3584.4052
redmass: 4.1264 5.1087 5.6431 6.4184 4.8508 5.0542 4.5227 6.6410 4.6818 6.9021 1.1097 3.7602 3.5014 3.8915 3.2695 4.6432 6.9400 4.9771 4.8983 6.2357 3.9684 6.7069 1.9698 1.9993 5.7454 1.6576 1.4955 1.4504 1.2608 6.1671 1.5698 1.4746 1.8149 2.4036 1.3845 6.1354 1.3403 5.5195 1.3361 2.2844 2.9316 1.5208 1.6628 1.3790 2.5052 1.1222 1.1080 1.1523 1.6226 3.0710 1.3567 1.4005 3.1560 8.9781 3.1714 2.4812 2.5691 2.3061 2.5335 4.9423 5.9341 6.4684 6.5513 6.1634 1.0888 1.0853 1.0893 1.0924 1.0939 1.0941 1.0936 1.0946 1.0964 1.0946 1.0661
irintensity: 0.0664 2.8621 1.3760 2.4015 2.9187 4.1233 1.0697 2.0690 3.7516 7.5546 147.0306 1.8665 4.5192 10.2062 6.0616 12.3698 1.2081 10.1827 11.8307 1.3110 6.1645 5.5880 12.3958 66.1564 20.7289 51.1056 53.6257 15.4773 1.1888 5.6960 25.5035 25.0869 23.0800 57.0865 1.9163 0.1138 4.3667 0.1717 1.4869 13.7613 27.8118 11.5996 30.7021 177.3198 55.4819 14.0559 3.6538 22.5547 6.3083 87.2987 5.8616 8.3697 14.3609 1.1873 10.5309 6.7018 19.3583 22.8234 54.6771 7.4507 76.7108 3.2094 4.7169 54.5178 12.3305 0.9789 9.6700 15.6132 14.4448 26.9699 1.3830 21.2044 7.3139 9.3173 45.3973
temp: 298.150 k
press: 1.00000 atm
elementType: 8 8 7 6 6 6 6 6 6 6 6 6 6 6 6 6 1 1 1 1 1 1 1 1 1 1 1
symmnumber: 1
zpe: 543660.6 jmol-1
zpe.correction: 0.207069 hartree
zpe.thermalcorrener: 0.220285 hartree
zpe.thermalcorrenthalpy: 0.221229 hartree
zpe.thermalcorrgfe: 0.166285 hartree
zpe.sumelectzpe: -706.003718 hartree
zpe.sumelectthermal: -705.990503 hartree
zpe.sumelectthermalent: -705.989558 hartree
zpe.sumelectthermalfe: -706.044502 hartree
dipole: -0.0835 -1.9953 -0.1604
dipole: 2.0035
quadrupole: -58.5688 -92.6425 -98.3784
quadrupole: -7.1688 -2.2417 -3.2152
quadrupole: 24.6278 -9.4459 -15.1818 -7.1688 -2.2417 -3.2152
hfenergy: -706.2107873 hartree
pointgroup: C01 [X(C13H11N1O2)]
dipole: -0.0092836 -0.5286671 0.5845861 debye
polarizability: 310.0304725|-6.9614831|96.6981823|-14.3972967|-42.5286616|127.7145641 unknown
InChI: InChI=1S/C13H11NO2/c15-13-8-4-5-11(9-13)10-14(16)12-6-2-1-3-7-12/h1-10,15H
charge 0 multiplicity 1
27 atoms
O  -4.674268 -1.35547 1.585361
O  0.66514 1.312598 -1.412904
N  0.832883 0.392623 -0.455954
C  -1.595106 0.048384 0.042459
C  2.232592 0.039932 -0.150781
C  -0.177977 -0.218773 0.198901
C  -2.482902 -0.734654 0.842848
C  -2.143868 1.031701 -0.843468
C  3.178144 0.21369 -1.184653
C  2.629315 -0.401578 1.133008
C  -3.872675 -0.540989 0.762536
C  -3.539948 1.208765 -0.902986
C  -4.417088 0.434115 -0.110747
C  4.531829 -0.097648 -0.940144
C  3.988523 -0.704696 1.366451
C  4.941578 -0.561296 0.332085
H  0.125268 -1.007436 0.891363
H  -2.098796 -1.496212 1.530119
H  -1.463968 1.621188 -1.459388
H  2.832606 0.596051 -2.148269
H  1.908672 -0.475209 1.953366
H  -3.957668 1.961727 -1.580205
H  -5.502689 0.58446 -0.172379
H  5.267835 0.025267 -1.741679
H  4.303362 -1.037671 2.361161
H  5.994649 -0.79618 0.51996
H  -5.633246 -1.149186 1.457139
