program: Gaussian 09
title: 000266020
version: EM64L-G09RevD.01
frameworkgroup: C1[X(C11H6Cl7NO2)]
method: RPBEPBE
basis: SDD
operation: Freq
keyword: #p
keyword: freq=noraman
keyword: PBEPBE/SDD
title: #p freq=noraman PBEPBE/SDD
converged: YES YES NO NO
title: Mulliken charges:
elementType: Cl Cl Cl Cl Cl Cl Cl O O N C C C C C C C C C C C H H H H H H
charge: 0.043275 0.053164 0.065782 0.075124 0.077756 0.067023 0.078200 -0.237095 -0.238516 -0.651396 0.491760 -0.207938 -0.162682 -0.215086 -0.071624 -0.057734 -0.275089 -0.281736 0.468189 -0.307558 -0.306750 0.318416 0.317797 0.234676 0.243707 0.235001 0.243336
chargesum: 0.00000
title: Mulliken charges with hydrogens summed into heavy atoms:
elementType: Cl Cl Cl Cl Cl Cl Cl O O N C C C C C C C C C C C
charge: 0.043275 0.053164 0.065782 0.075124 0.077756 0.067023 0.078200 -0.237095 -0.238516 -0.015184 0.491760 -0.207938 -0.162682 -0.215086 -0.071624 -0.057734 -0.275089 -0.281736 0.468189 0.170825 0.171587
polarizability: 1.85997531e+02 -5.34212484e+00 1.78664264e+02 -1.29046663e-01 -4.11033767e-01 1.80085463e+02
1716.lowfreq: -32.2586 0.0029 0.0031 0.0033 6.8344 8.8703 11.0201 58.4749 73.6764
frequency: -32.1315 58.4502 73.5563 96.8303 103.8185 111.0119 113.5584 122.6030 141.5662 143.8575 147.4288 149.2497 153.9202 155.1287 160.7919 175.9779 208.2933 248.1873 258.3566 285.9690 296.2289 307.7599 324.7088 331.0664 334.6414 341.3243 406.2807 520.4073 535.7194 555.1132 581.8864 623.1179 637.2701 672.3344 719.6554 753.3724 788.6642 808.0125 817.3241 830.1274 855.7180 866.8791 891.4804 906.7497 918.5388 934.5050 935.3272 975.8693 998.5465 1004.1191 1040.0389 1044.5321 1070.4354 1081.4066 1094.8360 1101.1294 1112.8059 1148.9972 1157.3684 1164.3198 1187.9102 1218.1526 1230.4832 1323.4042 1331.7692 1432.2588 1473.1014 1477.9646 1616.0335 3026.4964 3027.7531 3113.2001 3125.9782 3550.4301 3687.0221
redmass: 1.4916 6.6100 3.8329 27.2451 20.1050 30.9069 30.0721 30.6856 28.0103 7.1324 33.0889 31.1966 5.6086 6.0159 14.8286 5.0462 5.3468 2.6007 3.3970 1.4347 13.1531 12.9698 27.3785 18.4497 8.4466 26.6144 11.9327 6.1017 9.7304 10.4159 11.7043 3.0897 5.6487 9.2236 9.8598 11.1416 6.4482 10.2592 7.9809 10.1159 3.2306 7.5314 5.9844 6.2317 6.2480 5.2991 4.7848 4.0368 5.0166 7.8296 5.1233 11.7058 11.1255 11.9362 10.0785 1.7397 8.0743 10.1527 9.9460 1.1377 1.7024 2.4503 3.3388 1.2832 1.2376 7.9628 1.0882 1.0983 1.1281 1.0658 1.0579 1.1038 1.1085 1.0443 1.1038
irintensity: 12.3795 1.7764 6.8486 0.4500 0.1251 0.1950 0.0991 0.0428 0.3873 4.5293 0.1542 0.0309 0.8869 0.1139 2.1305 10.9189 5.3758 12.5144 2.3051 202.0178 1.6565 11.3753 0.0812 1.4649 1.6637 0.4332 6.1997 13.8008 12.9498 18.8384 42.5860 29.7692 37.1581 26.2512 17.5935 0.7852 6.6868 24.8219 13.8769 0.8831 4.9156 18.8961 18.2773 24.3818 7.5718 11.7380 9.8447 8.4742 42.7581 22.7593 48.8224 18.1615 29.7829 57.2525 11.4293 3.2357 23.3919 37.0720 14.9393 0.2571 113.3164 19.9260 88.0929 2.8872 0.1198 110.1187 8.7355 4.2537 97.3002 50.6636 30.5240 10.1557 18.4319 52.1899 32.3598
temp: 298.150 k
press: 1.00000 atm
elementType: 17 17 17 17 17 17 17 8 8 7 6 6 6 6 6 6 6 6 6 6 6 1 1 1 1 1 1
symmnumber: 1
zpe: 396078.4 jmol-1
zpe.correction: 0.150858 hartree
zpe.thermalcorrener: 0.171097 hartree
zpe.thermalcorrenthalpy: 0.172041 hartree
zpe.thermalcorrgfe: 0.101978 hartree
zpe.sumelectzpe: -3846.713532 hartree
zpe.sumelectthermal: -3846.693293 hartree
zpe.sumelectthermalent: -3846.692349 hartree
zpe.sumelectthermalfe: -3846.762412 hartree
dipole: -2.1668 0.9979 0.0462
dipole: 2.3860
quadrupole: -147.0552 -160.8938 -177.5409
quadrupole: 14.6887 1.6199 0.5574
quadrupole: 14.7748 0.9362 -15.7109 14.6887 1.6199 0.5574
hfenergy: -3846.8643899 hartree
pointgroup: C01 [X(C11H6Cl7N1O2)]
dipole: -0.6951283 0.6127549 0.1500987 debye
polarizability: 182.2731386|-6.2885866|182.4231404|-1.5849515|0.1605048|180.0509798 unknown
InChI: InChI=1S/C11H6Cl7NO2/c12-3-5(14)4(13)7(16)9(18,6(3,15)10(5,7)19)11(8(3,4)17)20-1-2-21-11/h1-2,19H2
charge 0 multiplicity 1
27 atoms
Cl 3.380725 -1.643561 -0.295553
Cl 0.685813 1.184678 2.986794
Cl 0.718124 2.250098 -2.219131
Cl 0.883017 -2.137735 2.287711
Cl 0.884434 -1.078941 -2.889019
Cl -1.183555 2.762313 0.58848
Cl -0.936208 -2.809004 -0.552976
O  -2.277217 -0.364024 1.139435
O  -2.266079 0.205702 -1.145886
N  2.977003 1.711763 0.263488
C  1.852443 0.896436 0.196003
C  1.88625 -0.656553 -0.100925
C  0.652722 0.620457 1.270938
C  0.665932 1.056823 -0.862256
C  0.733478 -0.944362 0.945367
C  0.738418 -0.513953 -1.184942
C  -0.441535 1.13273 0.258294
C  -0.338614 -1.12963 -0.205148
C  -1.430287 -0.040886 0.010828
C  -3.67478 -0.037347 0.737199
C  -3.642793 -0.23798 -0.787608
H  3.84753 1.341331 0.636271
H  2.885977 2.719352 0.160845
H  -3.899944 1.006625 1.017734
H  -4.330236 -0.741169 1.271209
H  -3.773457 -1.296181 -1.074731
H  -4.337663 0.409923 -1.342321
