program: Gaussian 09
title: 000266231
version: EM64L-G09RevD.01
frameworkgroup: C1[X(C21H20N2O4S)]
method: RPBEPBE
basis: SDD
operation: Freq
keyword: #p
keyword: freq=noraman
keyword: PBEPBE/SDD
title: #p freq=noraman PBEPBE/SDD
converged: YES YES NO NO
title: Mulliken charges:
elementType: S O O O O N N C C C C C C C C C C C C C C C C C C C C C H H H H H H H H H H H H H H H H H H H H
charge: 0.869337 -0.526428 -0.532274 -0.214509 -0.189265 -0.247995 0.011923 0.148453 0.181412 0.409589 -0.079857 -0.487715 0.473780 0.247230 -0.383679 -0.307623 -0.244139 -0.200502 -0.354878 -0.847365 0.457401 -0.385696 -0.362207 -0.350473 -0.810158 -0.254403 -0.222202 -0.799401 0.258463 0.238958 0.309745 0.286108 0.265129 0.235439 0.268647 0.268265 0.216762 0.242334 0.242901 0.281835 0.235376 0.232657 0.228216 0.243268 0.243029 0.244397 0.228063 0.232048
chargesum: 0.00000
title: Mulliken charges with hydrogens summed into heavy atoms:
elementType: S O O O O N N C C C C C C C C C C C C C C C C C C C C C
charge: 0.869337 -0.526428 -0.532274 -0.214509 -0.189265 -0.247995 0.011923 0.148453 0.181412 0.409589 -0.079857 -0.229252 0.473780 0.247230 -0.144721 0.002122 0.041969 0.064627 -0.119439 -0.093691 0.457401 -0.143362 -0.119306 -0.068638 -0.113909 -0.011135 0.020827 -0.094893
polarizability: 4.31580816e+02 3.06843665e+01 2.87540543e+02 -8.74824776e+00 -3.01254389e+01 2.68764063e+02
1716.lowfreq: -6.1096 0.0004 0.0013 0.0018 2.6197 6.6793 14.3352 16.0206 27.0505
frequency: 14.2383 15.3556 26.9968 35.2933 48.3162 50.0807 51.8251 58.8671 71.8615 79.3487 94.2462 114.3566 120.3253 137.0822 152.1761 154.1710 154.7634 177.0831 193.2354 214.9457 226.3468 235.2660 252.2238 279.5556 293.5455 308.2532 315.1504 366.8470 373.3015 379.2060 392.9714 404.7661 408.3965 430.2861 445.0925 452.7491 460.6128 493.0981 505.1742 548.4125 576.3470 581.6057 587.7805 600.9279 621.8046 646.2264 665.4768 699.9248 706.2511 721.7460 736.0896 764.3649 773.5834 774.5335 779.3094 785.5339 818.6279 827.8153 833.3687 843.5690 872.3003 889.1051 894.0066 939.7906 956.5101 961.5291 968.5124 979.4750 987.5419 991.6489 993.8588 1005.9682 1014.1325 1038.5305 1048.8726 1049.2934 1049.5182 1055.5879 1064.1574 1119.6063 1126.6034 1142.4117 1159.9441 1176.8508 1186.1914 1199.8873 1214.9962 1218.8855 1222.7403 1266.3871 1283.8947 1297.5525 1298.0251 1351.0715 1367.0668 1377.8084 1379.7189 1385.5747 1390.7036 1392.2044 1399.5552 1400.0473 1432.6875 1454.7095 1459.5338 1469.8439 1470.7455 1470.9733 1472.8530 1474.9860 1484.3886 1494.0884 1552.1815 1563.9400 1591.4463 1594.0590 1595.9151 1609.9434 2979.3335 2979.4990 2980.9849 3058.0236 3062.7827 3067.0399 3089.1753 3092.3712 3100.0293 3121.8015 3135.1488 3136.9102 3140.5868 3142.2324 3147.4943 3159.5142 3162.5193 3168.7807 3172.3624 3182.5746
redmass: 6.6518 5.1527 5.4109 4.2772 1.0250 5.0824 5.0934 5.6500 1.1308 5.9452 4.9559 5.2628 7.6271 5.4796 5.4470 10.4162 2.8644 5.1110 1.1976 6.6071 4.7806 4.7052 5.7696 5.4323 4.4083 3.1977 3.2872 7.0378 3.9427 6.9157 6.1902 3.9078 3.8474 4.8169 4.7902 3.2049 3.3667 4.9821 3.0637 4.3407 5.5463 4.4170 5.7497 5.6414 6.9612 7.7670 5.4648 5.8377 3.3159 2.9814 3.8781 3.5334 5.1023 7.6129 2.1818 3.8925 1.3654 1.4653 4.2848 1.2554 1.7212 2.5355 2.1322 2.4309 1.3111 1.3779 1.3545 1.3783 1.9731 1.3564 2.5603 1.8401 1.4564 2.7414 1.6355 1.5997 2.2258 1.5605 3.4084 1.2907 2.5597 1.8862 1.5141 1.1140 1.1322 3.9478 6.7083 3.0656 1.9571 1.6417 1.5680 1.2716 3.5381 9.8168 4.7244 5.5559 5.2302 1.6540 2.9087 1.9411 1.2445 1.2402 2.6437 1.4980 1.5443 1.0620 1.0907 1.2614 1.7303 1.0770 1.5131 1.7282 4.5402 6.1759 6.8033 6.0044 6.3382 5.8482 1.0375 1.0378 1.0385 1.0977 1.0954 1.0946 1.0987 1.0998 1.0996 1.0874 1.0896 1.0896 1.0907 1.0875 1.0964 1.0908 1.0955 1.0958 1.0950 1.0987
irintensity: 1.5446 1.7800 0.4481 1.1716 0.4904 1.0216 1.4608 1.3766 0.2082 0.2335 3.7142 3.9250 13.2948 5.4308 4.9165 1.1489 1.4806 3.3468 3.4462 10.1862 1.4457 1.7837 8.9310 11.4183 1.7194 0.8743 0.9363 9.2710 6.5886 6.3425 67.4111 25.3478 29.5117 1.9277 1.9890 4.7120 23.4337 25.3292 70.9811 5.8724 9.2569 40.8235 8.6401 1.4870 0.6811 4.1800 17.4925 6.2409 0.5649 11.9033 4.4651 5.2343 37.5771 1.2500 25.9533 58.0317 31.7557 25.1770 8.1268 4.4554 6.4033 19.6341 17.2754 2.6474 1.7612 2.5036 0.4316 0.5602 1.6152 0.6124 9.6874 1.4268 11.3998 5.7931 7.7235 12.9425 21.7726 14.5880 11.8378 8.8434 6.8966 5.8161 37.2603 4.7511 27.6325 49.6146 180.2447 11.7882 4.0880 7.4830 5.7406 3.8449 67.0877 143.4260 5.3085 15.9555 1.0153 3.3074 13.9861 30.4687 16.7387 8.4336 4.3186 11.9875 64.9708 8.5990 17.8531 20.8949 22.9692 13.7916 8.7112 45.5528 50.3336 19.1403 1.2675 9.5859 13.5334 3.0025 28.0279 25.5941 25.9185 15.9848 19.9939 15.4692 12.1685 15.3548 11.0232 6.7811 11.9023 10.4451 9.4358 3.3408 35.7835 6.3615 9.6240 5.2041 7.9657 8.6713
temp: 298.150 k
press: 1.00000 atm
elementType: 16 8 8 8 8 7 7 6 6 6 6 6 6 6 6 6 6 6 6 6 6 6 6 6 6 6 6 6 1 1 1 1 1 1 1 1 1 1 1 1 1 1 1 1 1 1 1 1
symmnumber: 1
zpe: 946666.2 jmol-1
zpe.correction: 0.360566 hartree
zpe.thermalcorrener: 0.388475 hartree
zpe.thermalcorrenthalpy: 0.389420 hartree
zpe.thermalcorrgfe: 0.298697 hartree
zpe.sumelectzpe: -1618.447074 hartree
zpe.sumelectthermal: -1618.419164 hartree
zpe.sumelectthermalent: -1618.418220 hartree
zpe.sumelectthermalfe: -1618.508942 hartree
dipole: 0.5832 2.8112 -0.4902
dipole: 2.9126
quadrupole: -129.8164 -165.2793 -184.9787
quadrupole: 0.4099 2.6024 -25.6123
quadrupole: 30.2084 -5.2545 -24.9539 0.4099 2.6024 -25.6123
hfenergy: -1618.8076398 hartree
pointgroup: C01 [X(C21H20N2O4S1)]
dipole: -0.2567501 1.1065155 0.1511403 debye
polarizability: 433.1368362|-28.5183305|288.2124486|-4.6581091|28.6484006|266.5361382 unknown
InChI: InChI=1S/C14H13N2O2.C7H7O2S/c1-10-7-8-11(2)13(9-10)15-12-5-3-4-6-14(12)16(17)18;1-6-2-4-7(5-3-6)10(8)9/h3-9H,1-2H3;2-5H,1H3
charge 0 multiplicity 1
48 atoms
S  -0.399602 -1.277617 1.481748
O  0.204369 -2.769494 1.173814
O  -0.510815 -0.77514 3.050596
O  -0.872723 2.598724 -2.866107
O  0.719261 1.001885 -2.516123
N  0.718825 0.040024 -0.048624
N  -0.052313 1.951317 -2.099472
C  2.035665 -0.438458 -0.13304
C  0.433674 1.386364 0.3209
C  2.280237 -1.604549 -0.947575
C  -2.139867 -1.153848 0.76412
C  3.124827 0.20407 0.544776
C  4.438994 -0.281291 0.461723
C  -0.006721 2.321503 -0.673809
C  3.611561 -2.080871 -1.012113
C  0.431065 1.840444 1.671618
C  -3.082768 -0.389428 1.469594
C  -2.43437 -1.824528 -0.434739
C  4.66578 -1.4503 -0.322741
C  1.194327 -2.256421 -1.768066
C  -4.73628 -0.948084 -0.27517
C  -4.388443 -0.297259 0.937065
C  -3.745519 -1.716604 -0.944716
C  -0.422285 3.629545 -0.341069
C  5.588379 0.400214 1.18167
C  0.021495 3.147162 2.004364
C  -0.402966 4.050355 1.001016
C  -6.13107 -0.815046 -0.857748
H  2.919887 1.099896 1.140553
H  3.822544 -2.959817 -1.631721
H  0.724968 1.147594 2.465082
H  -2.805893 0.0929 2.412573
H  -1.675486 -2.425087 -0.944102
H  5.682714 -1.854406 -0.40181
H  0.510312 -1.493952 -2.176036
H  0.607009 -2.945859 -1.133029
H  1.628619 -2.83633 -2.600265
H  -5.145028 0.286767 1.473342
H  -4.001488 -2.23431 -1.876366
H  -0.752985 4.289209 -1.148069
H  6.066866 -0.284017 1.90727
H  6.372597 0.721229 0.47071
H  5.249098 1.292337 1.734652
H  0.03891 3.459353 3.053996
H  -0.71292 5.067072 1.260965
H  -6.142762 -0.075691 -1.68167
H  -6.858305 -0.477706 -0.099807
H  -6.488775 -1.772955 -1.275163
