program: Gaussian 09
title: 000266019
version: EM64L-G09RevD.01
frameworkgroup: C1[X(C12H5Cl7O4)]
method: RPBEPBE
basis: SDD
operation: Freq
keyword: #p
keyword: freq=noraman
keyword: PBEPBE/SDD
title: #p freq=noraman PBEPBE/SDD
converged: YES YES NO NO
title: Mulliken charges:
elementType: Cl Cl Cl Cl Cl Cl Cl O O O O C C C C C C C C C C C C H H H H H
charge: 0.078164 0.083595 0.083901 0.087963 0.088443 0.086526 0.086972 -0.237797 -0.236458 -0.392803 -0.192119 0.523104 -0.232271 -0.218832 -0.221915 -0.059023 -0.057789 -0.230137 -0.281306 0.464281 0.031232 -0.305464 -0.308967 0.245064 0.236562 0.246195 0.236962 0.395917
chargesum: 0.00000
title: Mulliken charges with hydrogens summed into heavy atoms:
elementType: Cl Cl Cl Cl Cl Cl Cl O O O O C C C C C C C C C C C C
charge: 0.078164 0.083595 0.083901 0.087963 0.088443 0.086526 0.086972 -0.237797 -0.236458 0.003114 -0.192119 0.523104 -0.232271 -0.218832 -0.221915 -0.059023 -0.057789 -0.230137 -0.281306 0.464281 0.031232 0.176162 0.174190
polarizability: 1.95949757e+02 3.44781697e+00 1.97191690e+02 2.02595075e-01 -1.47919023e-01 1.81497346e+02
1716.lowfreq: -8.5609 -6.2423 0.0006 0.0017 0.0018 4.8632 27.4212 53.9230 59.4124
frequency: 27.3942 53.9089 59.3731 87.2874 90.0890 105.5585 109.2859 117.2150 119.0982 127.9923 140.4336 148.4690 150.0791 151.8127 155.9339 158.4898 164.3556 204.1852 249.9420 272.6134 292.3239 309.8490 316.4981 319.9000 326.4713 336.7854 356.4284 450.0448 490.3522 539.2106 571.2544 585.5231 595.6674 622.2424 639.0548 652.9726 686.1946 716.8377 764.0020 796.3859 835.1693 842.4884 850.4562 854.8085 867.0765 877.8153 926.0532 927.2255 935.3158 961.9176 974.6919 996.1197 1009.0769 1017.5995 1053.2484 1058.4701 1078.7118 1087.6148 1091.3369 1098.8651 1119.5143 1150.2500 1154.1717 1160.7637 1187.3670 1209.8542 1227.6037 1320.8295 1328.3063 1341.6725 1469.6995 1475.7523 1660.6840 3027.5331 3029.7585 3114.4529 3127.4264 3514.3727
redmass: 13.7688 6.5201 3.6625 10.3392 10.9454 21.2970 27.1460 29.2196 31.9658 29.7607 32.5670 17.7253 12.4356 3.6772 24.0003 21.8074 17.1301 11.5298 3.7818 10.2406 12.2688 23.7768 17.9722 10.0712 31.4995 26.5919 28.6426 4.9027 8.9625 12.5695 12.1682 1.3981 10.2281 2.8639 6.7485 5.5952 7.1221 9.8555 12.1501 9.8347 11.3623 5.7625 12.2203 11.9134 3.1943 8.9741 3.7988 6.3809 8.4898 7.7835 4.2359 4.8682 7.8723 5.7841 7.2592 11.7039 11.9363 8.9649 6.4696 1.8774 11.6413 9.2924 8.8845 1.1368 1.7059 2.5554 3.2680 1.2870 1.2428 5.2143 1.0895 1.0994 10.2169 1.0638 1.0598 1.1040 1.1086 1.0644
irintensity: 0.9285 1.6383 6.3442 0.2788 0.9211 0.0995 0.2412 0.0455 0.1061 0.1396 0.0030 0.0840 0.0041 0.5262 0.0455 0.0198 1.0129 3.1303 2.0813 1.3833 1.0372 0.0709 0.1910 0.3875 0.0003 0.0383 0.3947 2.5070 38.4182 3.4076 41.3632 126.9367 47.5873 23.9557 40.3080 4.4379 7.1355 11.4321 0.5317 28.7428 0.3817 1.4119 6.6622 11.3801 1.2859 27.7017 43.5792 6.1167 4.6742 13.9031 14.3635 51.3450 17.0602 119.3631 38.3387 102.3351 35.2333 22.0148 21.5470 8.0926 55.2785 27.8641 26.6131 0.1756 110.8123 26.7469 95.3543 2.6683 0.2132 99.5439 9.2120 4.2830 260.4523 44.8049 33.0972 9.2906 16.9771 44.3485
temp: 298.150 k
press: 1.00000 atm
elementType: 17 17 17 17 17 17 17 8 8 8 8 6 6 6 6 6 6 6 6 6 6 6 6 1 1 1 1 1
symmnumber: 1
zpe: 388939.4 jmol-1
zpe.correction: 0.148139 hartree
zpe.thermalcorrener: 0.170325 hartree
zpe.thermalcorrenthalpy: 0.171269 hartree
zpe.thermalcorrgfe: 0.095588 hartree
zpe.sumelectzpe: -3979.780792 hartree
zpe.sumelectthermal: -3979.758607 hartree
zpe.sumelectthermalent: -3979.757663 hartree
zpe.sumelectthermalfe: -3979.833343 hartree
dipole: -3.9013 -2.6073 -0.0410
dipole: 4.6925
quadrupole: -159.1958 -175.8384 -183.5249
quadrupole: -4.6351 -0.1834 -0.5420
quadrupole: 13.6572 -2.9853 -10.6719 -4.6351 -0.1834 -0.5420
hfenergy: -3979.9289314 hartree
pointgroup: C01 [X(C12H5Cl7O4)]
dipole: -1.49135 -1.087238 -0.0468618 debye
polarizability: 195.6688662|3.3774572|197.4669512|0.2816967|0.3548856|181.5029747 unknown
InChI: InChI=1S/C12H5Cl7O4/c13-5-4(3(20)21)6(14)8(5,16)11(19)9(5,17)7(4,15)10(6,18)12(11)22-1-2-23-12/h20H,1-2H2
charge 0 multiplicity 1
28 atoms
Cl 2.419756 2.725669 0.117864
Cl 0.836637 -1.205095 -2.714687
Cl 0.864695 -1.466918 2.573496
Cl 0.052353 2.084688 -2.540885
Cl 0.091637 1.827819 2.738103
Cl -0.701696 -2.884814 -0.131049
Cl -2.014297 2.635733 0.14108
O  -2.516109 -0.38995 -1.1818
O  -2.526468 -0.417541 1.173095
O  2.958702 -2.19907 -0.137894
O  4.145369 -0.195546 -0.01211
C  1.697087 -0.207801 -0.019036
C  1.311454 1.318748 0.058381
C  0.5507 -0.442087 -1.106766
C  0.562009 -0.546032 1.053714
C  0.173427 1.11713 -1.029799
C  0.188855 1.013111 1.138087
C  -0.423779 -1.094132 -0.051097
C  -0.964729 1.157016 0.06692
C  -1.704287 -0.208973 0.002345
C  3.062484 -0.811381 -0.052455
C  -3.932791 -0.485606 -0.726069
C  -3.792998 -1.045463 0.699973
H  -4.445274 -1.161342 -1.426758
H  -4.389382 0.519613 -0.740463
H  -4.583257 -0.719617 1.392287
H  -3.683385 -2.143968 0.711232
H  3.866489 -2.607787 -0.16071
