program: Gaussian 09
title: 000265992
version: EM64L-G09RevD.01
frameworkgroup: C1[X(C10H13N3O3)]
method: RPBEPBE
basis: SDD
operation: Freq
keyword: #p
keyword: freq=noraman
keyword: PBEPBE/SDD
title: #p freq=noraman PBEPBE/SDD
converged: NO YES NO NO
title: Mulliken charges:
elementType: O O O N N N C C C C C C C C C C H H H H H H H H H H H H H
charge: -0.439083 -0.308343 -0.232820 -0.189078 -0.464316 0.036506 0.466854 -0.408758 0.449037 -0.440807 -0.334927 0.356197 -0.363928 -0.377190 -0.291593 -0.805543 0.270400 0.246270 0.350532 0.228702 0.297581 0.225590 0.192871 0.234997 0.234345 0.228189 0.225440 0.238651 0.374225
chargesum: 0.00000
title: Mulliken charges with hydrogens summed into heavy atoms:
elementType: O O O N N N C C C C C C C C C C
charge: -0.064858 -0.308343 -0.232820 -0.189078 -0.113784 0.036506 0.466854 0.107912 0.449037 -0.212105 -0.037346 0.356197 -0.128931 -0.142846 0.126868 -0.113263
polarizability: 2.44626292e+02 -1.03227288e+01 1.55794807e+02 3.71438207e+00 7.27707487e+00 7.21081975e+01
1716.lowfreq: -3.2174 0.0005 0.0008 0.0010 4.2832 8.1736 17.8622 38.2417 45.5721
frequency: 17.8226 38.2050 45.5376 61.1051 79.3311 90.1853 150.9924 163.8442 194.3989 209.1133 252.9524 270.2383 307.6640 342.6395 348.5043 384.2284 406.0762 409.7070 475.5036 498.3833 515.6251 542.6523 634.5143 637.1014 688.7977 712.1799 717.0446 750.7489 786.2715 806.1028 833.3249 834.6463 851.3167 858.9153 936.7647 950.5248 972.0710 984.8018 989.2041 1009.3536 1047.3265 1048.7057 1066.0091 1099.7758 1133.5197 1196.4271 1202.2843 1225.2919 1238.5807 1262.9777 1287.9094 1317.7533 1340.4652 1362.3418 1375.0085 1385.1161 1398.4101 1415.1250 1423.2463 1439.3311 1468.9996 1471.0047 1473.2215 1508.7143 1526.6448 1595.4918 1626.3092 1643.6417 2947.2576 2975.2277 3015.9962 3056.5378 3063.9460 3082.2023 3086.0928 3115.6501 3130.8733 3141.7196 3195.0331 3384.5850 3431.6362
redmass: 1.0157 4.3741 5.1875 3.9830 5.7776 6.2199 4.2951 4.5852 4.6321 6.0442 4.0550 7.2211 4.8860 4.8335 4.0743 4.7024 2.5475 2.9195 7.9061 4.4127 2.6556 4.2726 3.4848 1.3125 6.2716 4.7804 3.0505 4.2191 1.2455 4.1859 1.7249 3.2140 1.2842 4.1458 3.0262 1.3443 3.0135 1.3411 1.4046 2.9778 1.6376 2.8535 2.7944 3.5276 1.3205 1.1094 1.0880 2.5771 2.7397 2.9477 1.3817 1.3307 1.2432 1.4548 5.8957 4.2026 1.2223 3.1512 1.2545 1.1254 1.0875 1.1130 1.0541 2.4545 2.2420 4.4785 6.2129 8.7826 1.0695 1.0390 1.0575 1.0947 1.0945 1.1034 1.0998 1.0878 1.0910 1.0967 1.0942 1.0658 1.0761
irintensity: 0.6065 0.0417 0.1215 6.4948 0.6170 0.8328 2.9952 8.5566 0.5247 12.9121 3.8037 3.0240 4.5024 12.7487 5.4451 11.6003 0.8046 0.0484 0.4138 6.0468 25.6582 19.5827 33.1810 126.7177 10.0659 40.6421 2.1764 7.7482 27.8348 27.8367 111.6088 127.4821 13.2733 28.0649 70.2370 7.4040 145.4902 3.2210 1.1436 2.3402 25.4811 37.5622 10.4034 58.4874 8.5537 1.6200 23.4927 2.1320 9.5165 6.9855 31.4686 9.4610 11.7152 51.0061 100.5867 179.6468 7.6035 45.7443 110.1890 18.4328 5.0727 31.7680 13.0174 11.3239 479.2519 42.6937 3.9008 299.8450 61.8672 37.4880 9.2439 22.7135 45.6206 7.3500 17.0504 13.8075 21.0419 14.5029 2.4686 267.0925 61.6837
temp: 298.150 k
press: 1.00000 atm
elementType: 8 8 8 7 7 7 6 6 6 6 6 6 6 6 6 6 1 1 1 1 1 1 1 1 1 1 1 1 1
symmnumber: 1
zpe: 591940.9 jmol-1
zpe.correction: 0.225458 hartree
zpe.thermalcorrener: 0.241215 hartree
zpe.thermalcorrenthalpy: 0.242159 hartree
zpe.thermalcorrgfe: 0.180002 hartree
zpe.sumelectzpe: -777.550378 hartree
zpe.sumelectthermal: -777.534622 hartree
zpe.sumelectthermalent: -777.533678 hartree
zpe.sumelectthermalfe: -777.595834 hartree
dipole: 3.4855 2.0430 -0.2857
dipole: 4.0502
quadrupole: -85.1263 -105.7285 -95.7029
quadrupole: -3.6031 3.0300 0.7487
quadrupole: 10.3930 -10.2093 -0.1837 -3.6031 3.0300 0.7487
hfenergy: -777.7758363 hartree
pointgroup: C01 [X(C10H13N3O3)]
dipole: -1.35338 0.8275047 0.1507048 debye
polarizability: 244.9529795|7.9460616|155.9527835|6.0932807|-1.8110551|71.6235336 unknown
InChI: InChI=1S/C10H13N3O3/c1-8-2-4-9(5-3-8)11-10(15)13(12-16)6-7-14/h2-5,11,14H,6-7H2,1H3
charge 0 multiplicity 1
29 atoms
O  3.511754 -2.592975 -0.431928
O  1.102066 -1.4446 0.266855
O  3.530682 2.476879 0.09556
N  2.434706 0.490749 0.255494
N  0.082353 0.678335 0.117984
N  2.401448 1.889124 0.06874
C  -1.304121 0.35238 0.04074
C  3.693193 -0.260209 0.481619
C  -4.117532 -0.123314 -0.11817
C  -2.212034 1.437624 -0.073453
C  -1.80155 -0.975361 0.079609
C  1.14691 -0.178422 0.213955
C  -3.597132 1.196772 -0.149853
C  -3.193067 -1.192166 0.001206
C  4.063382 -1.267114 -0.642913
C  -5.609103 -0.381349 -0.232725
H  3.615904 -0.81034 1.43657
H  4.468825 0.521385 0.573653
H  0.340972 1.673144 0.069702
H  -1.835221 2.468048 -0.098449
H  -1.108576 -1.813138 0.173683
H  5.158883 -1.400753 -0.634511
H  3.774465 -0.840459 -1.628762
H  -4.28397 2.047119 -0.23488
H  -3.567271 -2.222448 0.03518
H  -5.902856 -1.303051 0.29956
H  -6.198928 0.455045 0.181937
H  -5.911939 -0.503698 -1.291097
H  2.539759 -2.484407 -0.220205
