program: Gaussian 09
title: 000266006
version: EM64L-G09RevD.01
frameworkgroup: C1[X(C20H15ClN2O2)]
method: RPBEPBE
basis: SDD
operation: Freq
keyword: #p
keyword: freq=noraman
keyword: PBEPBE/SDD
title: #p freq=noraman PBEPBE/SDD
converged: YES YES NO NO
title: Mulliken charges:
elementType: Cl O O N N C C C C C C C C C C C C C C C C C C C C H H H H H H H H H H H H H H H
charge: -0.043303 -0.219041 -0.218283 -0.312422 -0.091870 -0.392316 0.622146 0.439213 0.225809 0.395748 -0.400563 -0.349632 -0.370134 -0.336364 -0.372730 -0.367327 -0.211047 -0.217470 -0.114013 -0.217291 -0.237973 -0.211584 -0.203539 -0.247180 -0.252782 0.277948 0.228102 0.253663 0.295121 0.246717 0.220054 0.276163 0.257939 0.260752 0.231886 0.229331 0.228251 0.231521 0.233652 0.232851
chargesum: 0.00000
title: Mulliken charges with hydrogens summed into heavy atoms:
elementType: Cl O O N N C C C C C C C C C C C C C C C C C C C C
charge: -0.043303 -0.219041 -0.218283 -0.312422 -0.091870 -0.114368 0.622146 0.439213 0.225809 0.395748 -0.172461 -0.095969 -0.075013 -0.089647 -0.152676 -0.091164 0.046892 0.043282 -0.114013 0.014595 -0.008642 0.016667 0.027982 -0.013528 -0.019931
polarizability: 2.87405041e+02 6.07913712e+00 2.35098881e+02 -1.13578244e+01 2.31206616e+01 2.08121385e+02
1716.lowfreq: -10.0946 -6.0048 -1.8630 -0.0015 -0.0013 0.0002 2.9494 21.4047 26.6518
frequency: -9.3266 21.1740 26.5565 34.7924 41.8926 53.4703 83.1148 105.5267 140.6354 165.4710 169.3996 202.9823 230.4582 266.2225 296.5747 319.5897 327.4906 330.4781 372.1634 398.4729 405.0150 406.2995 408.6956 447.9723 479.0145 505.3155 518.5785 546.2574 602.9565 611.6235 614.3568 623.6180 636.2530 648.5257 661.8315 686.4938 692.7918 694.9477 714.5007 742.0235 757.7130 762.3102 808.1419 826.8586 829.6100 832.5336 834.3975 841.0325 892.0480 902.1217 911.0821 918.1349 951.8482 966.6869 969.4020 973.3830 982.9935 984.8588 988.9122 991.9823 996.6146 1001.4380 1027.1461 1030.6247 1066.1616 1074.6435 1090.9993 1094.5187 1115.4556 1151.1765 1172.9786 1177.3500 1184.0719 1187.5929 1202.9908 1210.6296 1220.5587 1278.7509 1295.2391 1317.0012 1326.2686 1338.6707 1351.4492 1382.5958 1383.9060 1386.1930 1402.1694 1441.0179 1449.8844 1472.2732 1479.6168 1491.5959 1590.5331 1591.4865 1591.6871 1603.5891 1606.8237 1614.8162 1706.9201 3032.8277 3123.5219 3124.8526 3133.2388 3137.0909 3142.7447 3147.8679 3151.1950 3157.7711 3167.4418 3170.3608 3172.4258 3176.6873 3187.7902 3188.8851
redmass: 3.8055 5.4358 5.5851 5.3274 4.5411 5.5094 11.2224 7.0123 6.0358 6.8223 7.3023 5.4031 6.4687 7.0241 6.6978 5.6619 6.6756 6.2953 7.1981 4.4924 2.8732 2.9198 3.7861 7.7472 3.7437 3.5744 3.3740 6.6495 5.8424 6.4912 6.4115 7.1766 7.6517 8.7184 7.7920 6.4486 2.0396 2.0722 4.6947 3.6418 1.9101 1.6952 3.3175 1.4719 1.8222 1.9234 1.4146 1.7810 5.5386 1.6186 1.4214 4.2526 1.4552 1.3750 1.4033 1.3725 5.2799 6.0031 5.8434 1.3523 1.3182 4.0878 2.0993 2.5840 3.2510 2.7797 1.5995 1.7990 1.3795 3.2995 1.0477 1.0535 1.2020 1.1233 1.2674 2.2367 3.2173 1.7334 1.3805 1.3507 1.6145 1.3491 2.5535 7.7700 7.8978 5.6913 2.3315 2.3447 2.4116 2.2006 2.4339 2.3420 6.4885 6.4060 7.2979 6.1787 6.1474 5.9200 12.2868 1.0861 1.0892 1.0868 1.0851 1.0878 1.0896 1.0941 1.0890 1.0937 1.0991 1.0993 1.0950 1.0966 1.0956 1.0952
irintensity: 0.2890 0.4591 0.1296 0.0321 0.1620 0.2146 1.2098 0.8957 0.8358 1.4083 1.0644 0.6908 1.7391 2.3372 2.5425 1.2195 0.2623 2.1605 2.1894 9.7077 0.2823 0.2685 7.0093 19.1980 7.8950 29.6986 8.3378 14.3907 12.6647 1.5702 0.3735 1.8004 17.0740 18.8912 21.2828 1.6513 28.5059 48.8227 2.4494 28.7632 43.5132 76.0749 23.1936 18.7115 22.2308 25.1137 23.3566 38.9941 51.2580 36.1544 10.3263 32.7534 4.0673 1.0752 0.8735 0.0895 0.2732 3.5871 26.9704 1.1243 1.4271 30.0454 27.4988 1.9382 113.6258 60.5004 18.9657 54.6336 15.7482 91.4844 0.2019 1.6938 12.5361 6.5474 13.4198 110.4289 22.6833 32.7673 27.7355 9.0711 44.1525 5.7696 199.0297 1.8569 5.6404 7.6852 25.3361 7.4850 10.5007 82.0311 63.7695 136.4869 2.2808 7.8629 4.7755 32.7407 66.3188 58.5142 387.6107 4.5484 22.9314 3.3269 1.6437 1.5610 11.5540 29.4353 3.2148 33.7252 23.1522 10.2916 3.5629 0.5463 6.1973 2.5329
temp: 298.150 k
press: 1.00000 atm
elementType: 17 8 8 7 7 6 6 6 6 6 6 6 6 6 6 6 6 6 6 6 6 6 6 6 6 1 1 1 1 1 1 1 1 1 1 1 1 1 1 1
symmnumber: 1
zpe: 786435.4 jmol-1
zpe.correction: 0.299537 hartree
zpe.thermalcorrener: 0.319152 hartree
zpe.thermalcorrenthalpy: 0.320096 hartree
zpe.thermalcorrgfe: 0.248923 hartree
zpe.sumelectzpe: -1489.367896 hartree
zpe.sumelectthermal: -1489.348281 hartree
zpe.sumelectthermalent: -1489.347337 hartree
zpe.sumelectthermalfe: -1489.418510 hartree
dipole: -0.4165 0.5152 -4.7501
dipole: 4.7960
quadrupole: -152.4391 -146.3685 -151.2280
quadrupole: 7.1065 3.3115 3.8970
quadrupole: -2.4273 3.6434 -1.2161 7.1065 3.3115 3.8970
hfenergy: -1489.6674333 hartree
pointgroup: C01 [X(C20H15Cl1N2O2)]
dipole: -0.2305989 -0.2354405 -1.8579003 debye
polarizability: 259.6206785|-28.7819509|260.8067125|-15.899278|-20.2499022|210.1979157 unknown
InChI: InChI=1S/C20H15ClN2O2/c21-16-13-11-15(12-14-16)19-22(17-7-3-1-4-8-17)20(24)25-23(19)18-9-5-2-6-10-18/h1-14,19H
charge 0 multiplicity 1
40 atoms
Cl -2.274411 5.940215 0.40162
O  1.375522 -0.235016 1.866355
O  -0.168858 -1.783974 2.713643
N  -0.436593 -0.744488 0.56217
N  1.638447 0.325683 0.506021
C  0.273698 0.359312 -0.134842
C  -0.397342 1.723099 0.013688
C  -1.625103 -1.352767 0.042776
C  0.17392 -1.038016 1.780848
C  2.674138 -0.43252 -0.170086
C  -0.124598 2.721417 -0.952309
C  -1.254901 2.025107 1.096315
C  -2.220857 -2.468177 0.690574
C  -2.206063 -0.839955 -1.147769
C  2.956365 -0.116706 -1.526178
C  3.468757 -1.384573 0.514486
C  -0.6896 4.009532 -0.843713
C  -1.827751 3.309082 1.223117
C  -1.534914 4.282931 0.249712
C  -3.376739 -3.057526 0.137981
C  -3.361041 -1.443734 -1.686841
C  4.001608 -0.782863 -2.198451
C  4.51591 -2.037766 -0.171746
C  -3.954219 -2.556636 -1.051106
C  4.785969 -1.750519 -1.528606
H  0.401416 0.112165 -1.204008
H  0.540583 2.503737 -1.797102
H  -1.490257 1.262983 1.846202
H  -1.788825 -2.859202 1.613953
H  -1.784086 0.035748 -1.649348
H  2.391638 0.665593 -2.046091
H  3.268259 -1.602533 1.565723
H  -0.47952 4.781464 -1.589245
H  -2.490459 3.545011 2.060213
H  -3.826477 -3.917687 0.645874
H  -3.798889 -1.035481 -2.6042
H  4.210258 -0.533551 -3.244704
H  5.12192 -2.777346 0.362965
H  -4.851623 -3.021988 -1.471529
H  5.599318 -2.262553 -2.052962
