program: Gaussian 09
title: 000265985
version: EM64L-G09RevD.01
frameworkgroup: C1[X(C11H12O3)]
method: RPBEPBE
basis: SDD
operation: Freq
keyword: #pfreq=noraman
keyword: PBEPBE/SDD
title: #p freq=noraman PBEPBE/SDD
converged: YES YES NO NO
title: Mulliken charges:
elementType: O O O C C C C C C C C C C C H H H H H H H H H H H H
charge: -0.262431 -0.193249 -0.252249 -0.241280 0.474921 0.225678 -0.456007 -0.354082 -0.220890 -0.222547 -0.781081 -0.236305 0.321507 -0.762146 0.247496 0.235567 0.269591 0.229751 0.229861 0.244049 0.261991 0.255574 0.232132 0.259873 0.250194 0.244083
chargesum: 0.00000
title: Mulliken charges with hydrogens summed into heavy atoms:
elementType: O O O C C C C C C C C C C C
charge: -0.262431 -0.193249 -0.252249 0.006216 0.474921 0.225678 -0.220440 -0.084492 0.008861 0.007314 -0.019467 -0.004173 0.321507 -0.007996
polarizability: 1.62718543e+02 -6.28685119e+00 1.00296536e+02 -4.32112851e+00 -1.63166493e+01 1.10855785e+02
1716.lowfreq: -9.7145 -6.8081 -0.0004 0.0004 0.0006 4.8261 30.3623 36.3998 64.6153
frequency: 30.2599 36.2932 64.6090 70.1075 81.8307 91.3973 109.5004 148.3170 215.7640 230.9527 269.8895 307.8169 323.7699 402.4851 433.9578 474.3942 539.6922 560.1219 564.6235 613.1602 630.5952 660.0494 702.2903 755.3131 809.6362 841.0461 854.5922 882.0509 930.9815 938.4791 976.8576 979.6249 990.2165 998.4694 1001.0789 1015.4169 1027.0198 1042.7549 1084.0772 1168.3474 1174.1296 1187.3724 1195.4512 1199.9013 1252.1307 1309.6746 1333.1196 1366.9682 1383.3274 1385.9284 1441.3498 1444.7075 1452.9566 1453.4345 1454.2310 1482.5550 1594.0330 1611.4014 1642.5155 1653.4609 2983.6933 3006.9564 3028.5829 3069.8739 3100.9053 3120.2013 3125.4358 3131.2806 3141.2334 3143.9834 3156.1076 3168.4682
redmass: 3.7631 4.3220 1.5626 2.5362 3.4985 3.5141 6.2376 1.0335 6.4200 4.6045 4.6554 5.5022 3.6399 2.8075 3.5583 3.6398 3.4710 3.6741 3.5845 6.3857 4.4237 5.4349 1.7931 1.9644 3.4512 4.3899 1.2478 3.3938 1.6898 3.0516 2.3547 1.4776 5.7206 1.4365 1.9068 1.7960 2.1482 1.6534 1.6091 2.1191 1.0706 1.1678 1.7614 3.1189 2.4180 1.3478 1.2797 1.2441 1.3472 5.3672 2.1499 1.0676 1.0543 1.0598 1.0592 2.3011 6.1739 6.0083 9.3824 8.9807 1.0373 1.0381 1.0850 1.0959 1.0943 1.0875 1.1000 1.0871 1.1025 1.0919 1.0961 1.1013
irintensity: 0.1880 7.0528 1.6554 0.6876 1.0815 5.9615 1.6080 0.1660 8.5089 1.8182 0.7649 0.3481 3.5123 0.6399 4.2543 10.1074 22.7515 2.8665 6.0195 0.0835 6.2417 11.9975 54.0793 48.0242 3.2446 15.9181 0.0021 19.8031 28.0540 39.2118 22.3690 3.2963 2.8189 19.2605 63.4748 1.2976 3.0250 9.9067 10.0531 74.6270 2.3922 24.3991 87.7713 228.5965 56.9249 11.6264 0.7708 68.0248 48.7631 9.4628 7.4484 20.6296 14.7316 29.9908 10.5454 15.0959 3.9389 3.8590 175.6595 96.9572 1.2633 1.2724 11.0532 8.6254 7.6075 6.4995 11.3552 0.9319 8.8813 21.4788 21.8522 16.5646
temp: 298.150 k
press: 1.00000 atm
elementType: 8 8 8 6 6 6 6 6 6 6 6 6 6 6 1 1 1 1 1 1 1 1 1 1 1 1
symmnumber: 1
zpe: 532656.5 jmol-1
zpe.correction: 0.202878 hartree
zpe.thermalcorrener: 0.217136 hartree
zpe.thermalcorrenthalpy: 0.218080 hartree
zpe.thermalcorrgfe: 0.159714 hartree
zpe.sumelectzpe: -651.014238 hartree
zpe.sumelectthermal: -650.999980 hartree
zpe.sumelectthermalent: -650.999036 hartree
zpe.sumelectthermalfe: -651.057403 hartree
dipole: 2.5007 -0.5578 -1.4603
dipole: 2.9491
quadrupole: -78.1827 -76.7342 -82.0836
quadrupole: 6.3722 -0.7947 -5.4332
quadrupole: 0.8174 2.2660 -3.0834 6.3722 -0.7947 -5.4332
hfenergy: -651.2171166 hartree
pointgroup: C01 [X(C11H12O3)]
dipole: -0.9988196 0.0868445 -0.5839906 debye
dipolederiv: -1.6460825 -0.2711758 0.1969605 -0.3175358 -0.5762652 0.0381496 0.2077011 0.0511003 -0.2713349 -0.4406803 -0.0381868 -0.1825632 0.0054834 -0.5586103 -0.051562 -0.311787 0.0457166 -0.7203605 -0.876414 -0.050818 0.1267346 0.3057842 -0.7488116 -0.1618389 0.250513 -0.0799969 -0.4000526 0.4922507 0.2634473 -0.2279731 0.5223555 0.207165 0.0370875 -0.1640908 0.1093514 0.1466062 0.2163319 -0.1128094 0.0765009 0.0270547 -0.0790566 0.0480498 -0.0700279 0.0539805 -0.0657183 0.2860813 -0.0203174 0.2799011 -0.3106173 1.1017156 -0.0433479 0.4347454 -0.1770467 0.789088 -0.0858018 -0.01818 -0.0674457 -0.0017207 -0.1211017 0.082475 0.0319406 0.0826738 0.011607 -0.0646163 0.0486347 0.0646826 0.0815343 -0.1175923 0.040009 0.0259201 0.0327231 -0.0365133 -0.0086681 0.0377576 0.1012533 0.0439762 -0.1015494 0.0636777 0.1217676 0.0649171 0.0077382 -0.047516 -0.0477591 -0.0710949 -0.0727446 -0.0657112 0.1162744 -0.054785 0.1165255 0.0604182 0.0825567 0.007514 -0.0082951 0.0190397 -0.5111932 -0.1000788 -0.0051974 -0.1510672 -0.0806118 0.0818968 -0.0278331 -0.0173903 -0.0351878 -0.1281142 0.049839 -0.0289156 0.0487523 -0.0694727 1.9298222 0.3158521 -0.2540715 -0.1156733 1.0388063 0.2530429 -0.3505895 0.1658654 0.3411742 -0.1639421 -0.1680561 -0.0292108 -0.1762815 -0.2803608 -0.0782478 -0.0918832 -0.1723018 -0.0212737 0.0289849 -0.02342 0.0200343 -0.0590287 -0.0240426 -0.041731 0.0217824 -0.0637666 -0.0503502 0.0598106 0.0473909 0.081621 0.0370667 0.0927173 -0.0937549 0.0609207 -0.0924044 -0.0178253 0.0551395 -0.0313068 -0.0723814 -0.0163848 0.1250314 -0.0368921 -0.0880791 -0.0394471 0.0521776 -0.0196402 -0.0284851 -0.0936494 -0.0394916 0.123379 -0.075228 -0.1050366 -0.0721653 0.0017242 0.0458978 0.0383706 0.046559 0.0441566 0.0915209 -0.1055649 0.068794 -0.1081556 -0.0299669 -0.0605511 -0.0432475 -0.0815355 0.004008 0.1075764 -0.005306 -0.0849033 0.016827 0.0796112 0.0312466 0.0264154 0.0840105 -0.0268283 0.1097269 -0.0059824 0.0858253 -0.0020614 0.0348056 0.1150804 0.0103902 -0.0285984 0.002714 0.0044059 0.0652177 -0.0330453 0.1161068 -0.0143016 -0.1246575 0.0415919 0.0208298 0.0466044 0.1350344 -0.0323464 0.0200629 -0.0315365 0.103766 0.1187131 -0.0201112 -0.0156558 -0.012963 0.0954653 0.0266567 -0.035914 0.0044144 -0.0428448 0.0349532 0.1001943 -0.0384985 0.0630398 0.0027173 0.0269018 -0.0142707 0.0561691 0.1195983 -0.0401957 -0.0358524 0.089276 -0.0183603 0.0771474 -0.0155 0.1085521 0.0248261 0.072312 unknown
polarizability: 163.2971551|-1.8078853|103.8634486|3.2402561|17.4125239|106.7102599 unknown
InChI: InChI=1S/C11H12O3/c1-8(12)11(14-9(2)13)10-6-4-3-5-7-10/h3-7,11H,1-2H3
charge 0 multiplicity 1
26 atoms
O  1.244842 1.005512 -0.296849
O  1.492715 -0.884667 1.740067
O  3.186528 -0.1084 -0.939605
C  0.526935 -0.287833 -0.437814
C  -0.957273 -0.011851 -0.273185
C  1.025684 -1.289183 0.649032
C  -1.879828 -0.444911 -1.255906
C  -1.428679 0.656334 0.885708
C  -3.263753 -0.213356 -1.084948
C  -2.80971 0.893195 1.05108
C  0.87662 -2.753733 0.289784
C  -3.730933 0.456795 0.068724
C  2.625522 0.939855 -0.545937
C  3.283852 2.266717 -0.259297
H  0.745305 -0.715681 -1.433555
H  -1.517778 -0.950994 -2.159463
H  -0.709732 0.989209 1.641773
H  -3.972152 -0.547188 -1.851042
H  -3.169741 1.41407 1.945116
H  -0.111582 -2.957989 -0.161282
H  1.646874 -3.012457 -0.462636
H  1.021001 -3.384835 1.179935
H  -4.803106 0.639952 0.200775
H  3.525127 2.318607 0.818286
H  2.607008 3.102725 -0.494319
H  4.219954 2.351107 -0.831142
