program: Gaussian 09
title: 000266013
version: EM64L-G09RevD.01
frameworkgroup: C1[X(C20H15N3O4)]
method: RPBEPBE
basis: SDD
operation: Freq
keyword: #p
keyword: freq=noraman
keyword: PBEPBE/SDD
title: #p freq=noraman PBEPBE/SDD
converged: YES YES NO NO
title: Mulliken charges:
elementType: O O O O N N N C C C C C C C C C C C C C C C C C C C C H H H H H H H H H H H H H H H
charge: -0.210919 -0.212214 -0.209584 -0.213183 -0.307174 -0.094808 0.021377 -0.401149 0.616971 0.452712 0.238432 0.391055 -0.421472 -0.351181 -0.335576 -0.311096 -0.378879 -0.366182 -0.227513 -0.233823 -0.370441 -0.391219 -0.230650 0.400017 -0.207754 -0.202573 -0.251045 0.282540 0.223081 0.244166 0.306094 0.264311 0.228158 0.274810 0.233634 0.235975 0.290044 0.288466 0.238001 0.230436 0.233253 0.234904
chargesum: 0.00000
title: Mulliken charges with hydrogens summed into heavy atoms:
elementType: O O O O N N N C C C C C C C C C C C C C C C C C C C C
charge: -0.210919 -0.212214 -0.209584 -0.213183 -0.307174 -0.094808 0.021377 -0.118609 0.616971 0.452712 0.238432 0.391055 -0.198392 -0.107015 -0.029482 -0.046784 -0.150721 -0.091372 0.006121 0.002152 -0.080397 -0.102753 0.007351 0.400017 0.022681 0.030679 -0.016141
polarizability: 3.02267545e+02 -1.11747220e+01 2.47103484e+02 -5.55526136e+00 -2.15767712e+01 2.35802344e+02
1716.lowfreq: -10.1649 -5.0535 -2.4781 0.0004 0.0007 0.0008 11.7761 18.4339 31.4530
frequency: 11.3320 18.3926 31.3809 36.3437 37.5794 54.7665 74.9949 83.9822 91.4800 124.7676 146.6219 194.9443 224.8898 225.4795 230.3206 260.5535 291.8515 307.7782 346.1688 357.7313 399.0819 402.7685 414.6311 414.7937 453.9070 472.7924 507.8421 511.1606 514.9398 547.0030 606.3019 610.1726 613.8905 620.5731 627.4465 641.8994 661.9392 666.7820 682.5462 695.2717 700.9761 729.7316 734.8439 754.9474 781.3085 789.4656 811.6917 826.2150 833.3969 835.7270 848.6977 868.0155 896.9157 905.9695 912.7094 928.5905 967.6886 976.6920 978.9612 983.0177 986.4538 990.8522 992.7672 1000.6726 1002.5077 1003.2514 1025.8891 1027.4760 1061.1215 1091.3332 1092.5714 1099.3549 1118.8995 1145.3235 1173.8378 1177.4263 1185.5268 1190.2309 1192.9793 1209.0800 1220.6127 1230.1912 1285.9736 1305.8786 1313.6058 1318.5448 1346.3297 1351.2707 1361.1285 1383.5125 1389.8126 1399.4386 1438.2154 1441.0298 1445.3732 1472.3030 1485.2890 1494.8225 1590.4569 1590.9564 1598.7371 1606.0498 1613.2318 1614.3946 1700.9607 3029.2014 3109.2991 3128.2492 3134.6129 3138.9653 3144.0549 3149.8334 3155.8173 3168.7830 3168.8264 3171.0590 3178.9730 3187.7407 3188.2519 3197.4296
redmass: 4.5084 5.5727 4.2435 5.7786 5.4808 6.0671 6.5114 6.9253 10.0295 7.9204 5.7236 6.4522 6.8497 6.1958 7.2056 5.3048 6.6818 6.8824 6.7525 7.7018 2.7853 3.2044 4.4689 3.5932 6.5608 4.1636 4.6090 5.0551 3.7124 7.4335 5.8641 6.8022 6.5028 5.9930 7.0089 8.3399 6.8284 5.5636 8.8739 2.0852 1.7130 4.4831 4.8882 1.7024 3.7278 3.7667 4.6133 1.6510 1.4006 2.8893 1.2568 1.5257 2.7125 2.3453 2.8266 1.9197 1.3718 1.3983 1.3569 5.1865 6.6847 6.1635 1.3493 3.2613 1.3490 1.3314 2.2421 2.1401 4.2889 1.7074 1.5806 2.8391 1.9798 2.0377 1.0484 1.0546 1.1978 1.7101 1.1298 2.8006 3.1520 2.9999 1.6699 1.5047 1.3328 1.3524 1.7840 1.8914 6.8232 8.4504 5.6759 9.7482 3.7259 2.3325 2.1249 2.1899 2.2720 2.6348 7.8137 6.6269 6.0597 6.1223 6.1001 5.9843 12.2716 1.0865 1.0891 1.0858 1.0860 1.0880 1.0907 1.0943 1.0959 1.0983 1.0892 1.1014 1.0899 1.0954 1.0962 1.0964
irintensity: 0.1205 0.2692 0.2088 0.4860 0.3333 0.8898 0.0190 0.3294 4.7396 3.0545 0.3626 1.5637 2.3507 1.6101 2.4960 0.3484 0.5738 0.8366 4.0160 3.4153 0.0788 0.1473 1.8193 0.7801 13.5082 14.3499 7.2671 4.7110 8.8167 12.4026 8.7984 5.8546 0.4212 20.8978 3.0190 28.6835 30.6101 6.4929 2.0459 25.6863 55.7259 28.2836 6.8813 45.4732 1.4118 107.1125 4.4850 8.8300 3.8203 31.2622 0.5117 63.8418 22.1869 80.2292 20.7232 17.9093 0.5252 0.0547 0.6403 0.4619 15.2861 5.6531 1.0664 1.1348 0.2574 0.4882 9.3358 30.1092 182.1578 58.5999 6.7388 44.4722 100.2100 123.1298 0.3333 0.3322 11.9127 279.6592 10.4268 156.0273 21.6741 296.1913 27.3527 42.3471 4.7593 13.0639 159.5211 178.5095 118.7076 6.9380 4.5834 16.0776 24.9414 12.0738 17.8867 85.9803 6.3177 138.3033 2.5618 5.7703 4.4360 93.7606 191.1541 32.9081 359.1837 4.1019 13.7823 9.5970 0.4963 2.0650 9.3690 27.1250 23.9596 18.6645 7.5744 17.5651 2.7130 2.4222 5.1631 2.6760
temp: 298.150 k
press: 1.00000 atm
elementType: 8 8 8 8 7 7 7 6 6 6 6 6 6 6 6 6 6 6 6 6 6 6 6 6 6 6 6 1 1 1 1 1 1 1 1 1 1 1 1 1 1 1
symmnumber: 1
zpe: 815251.7 jmol-1
zpe.correction: 0.310513 hartree
zpe.thermalcorrener: 0.332403 hartree
zpe.thermalcorrenthalpy: 0.333348 hartree
zpe.thermalcorrgfe: 0.255388 hartree
zpe.sumelectzpe: -1234.281866 hartree
zpe.sumelectthermal: -1234.259975 hartree
zpe.sumelectthermalent: -1234.259031 hartree
zpe.sumelectthermalfe: -1234.336991 hartree
dipole: 5.0680 2.7856 -2.9402
dipole: 6.4876
quadrupole: -198.4501 -138.4438 -155.4102
quadrupole: -15.2053 -17.9752 -1.2382
quadrupole: -34.3487 25.6575 8.6912 -15.2053 -17.9752 -1.2382
hfenergy: -1234.5923788 hartree
pointgroup: C01 [X(C20H15N3O4)]
dipole: -1.9096539 1.2968476 1.0891725 debye
polarizability: 303.0271501|8.2459865|249.839711|-6.698107|20.4176219|232.3065113 unknown
InChI: InChI=1S/C20H15N3O4/c24-20-21(16-11-13-18(14-12-16)23(25)26)19(15-7-3-1-4-8-15)22(27-20)17-9-5-2-6-10-17/h1-14,19H
charge 0 multiplicity 1
42 atoms
O  -2.172918 -0.255849 -1.854192
O  -0.379131 -1.319285 -2.91638
O  5.927686 -2.157066 0.019567
O  5.698838 -0.746612 1.800301
N  -0.156074 -0.25068 -0.772779
N  -2.422048 0.231233 -0.463107
N  5.240762 -1.335159 0.743265
C  -1.05389 0.618552 0.043386
C  -0.773575 2.110586 -0.099563
C  1.194965 -0.514266 -0.423443
C  -0.808264 -0.698715 -1.930177
C  -3.161711 -0.756337 0.300082
C  -0.985399 2.948557 1.021717
C  -0.344257 2.677647 -1.322865
C  1.991509 -1.413106 -1.190504
C  1.756423 0.118062 0.723176
C  -3.389867 -0.491342 1.677055
C  -3.739333 -1.897443 -0.308361
C  -0.779774 4.341803 0.922771
C  -0.139334 4.070473 -1.423264
C  3.314945 -1.679996 -0.806524
C  3.079274 -0.150677 1.106869
C  -0.356825 4.905676 -0.302759
C  3.848624 -1.05153 0.340115
C  -4.157266 -1.391296 2.444594
C  -4.511486 -2.784252 0.473959
C  -4.71938 -2.545491 1.850906
H  -0.999787 0.320805 1.106225
H  -1.316835 2.515049 1.974696
H  -0.167952 2.041666 -2.197235
H  1.573647 -1.887923 -2.079708
H  1.177595 0.83909 1.305113
H  -3.009309 0.427241 2.137748
H  -3.590581 -2.080349 -1.374863
H  -0.945212 4.983519 1.794733
H  0.191328 4.50434 -2.372849
H  3.940128 -2.368776 -1.380481
H  3.526186 0.327679 1.982035
H  -0.194314 5.985908 -0.383143
H  -4.327883 -1.179843 3.505851
H  -4.950825 -3.667826 -0.001681
H  -5.31858 -3.23907 2.449513
