program: Gaussian 09
title: 000265981
version: EM64L-G09RevD.01
frameworkgroup: C1[X(C12H21NO)]
method: RPBEPBE
basis: SDD
operation: Freq
keyword: #p
keyword: freq=noraman
keyword: PBEPBE/SDD
title: #p freq=noraman PBEPBE/SDD
converged: YES YES NO NO
title: Mulliken charges:
elementType: O N C C C C C C C C C C C C H H H H H H H H H H H H H H H H H H H H H
charge: -0.251460 -0.174511 0.013939 -0.070442 -0.138729 -0.391509 -0.393598 -0.425418 -0.432683 -0.432470 -0.412580 -0.401119 -0.400944 -0.386384 0.190703 0.215999 0.229385 0.209437 0.212132 0.205585 0.205148 0.220317 0.199834 0.202126 0.205831 0.190533 0.205477 0.229120 0.205800 0.198533 0.192253 0.193092 0.198396 0.197843 0.190361
chargesum: 0.00000
title: Mulliken charges with hydrogens summed into heavy atoms:
elementType: O N C C C C C C C C C C C C
charge: -0.251460 -0.174511 0.204642 0.145557 0.090656 0.030061 0.017135 -0.005266 -0.024725 -0.036459 0.022341 -0.010333 -0.009456 0.001820
polarizability: 1.56380468e+02 -2.41854593e+00 1.26244036e+02 1.87900539e+00 4.58860657e-02 1.08959549e+02
1716.lowfreq: -11.6625 -0.0008 0.0004 0.0005 11.4755 21.1284 44.4911 54.0922 133.4394
frequency: 44.1325 53.3923 133.4326 144.1393 216.3776 230.0500 235.2753 286.8380 315.9268 332.7598 398.3695 406.3301 428.0361 438.6579 443.1571 492.2663 511.4637 586.3864 706.3399 729.8458 756.2673 784.3749 797.3168 802.7440 824.1493 850.3414 856.3033 874.1286 886.2867 892.1098 921.8142 929.8818 950.0539 974.3382 983.5575 994.3932 1028.6807 1054.6367 1056.2979 1077.6731 1078.5399 1092.8816 1109.9722 1114.7869 1125.7628 1143.4103 1149.7985 1173.7526 1194.2215 1198.5173 1235.8391 1240.3008 1253.2760 1257.2603 1266.1698 1290.9012 1292.3077 1300.7874 1309.8116 1318.8402 1329.6276 1335.1399 1335.3252 1341.1370 1343.0803 1344.2708 1351.9603 1359.3519 1369.7551 1446.9824 1454.8888 1461.1913 1463.1177 1464.9944 1466.0242 1470.4450 1479.5337 1482.0225 2829.6970 2952.3648 2966.0752 2966.6696 2968.6899 2973.4778 2978.2149 2983.1130 2988.1854 2997.8362 3022.8367 3027.3761 3028.7289 3036.3561 3038.2720 3039.7869 3047.3399 3048.0682 3062.8676 3066.3926 3080.0161
redmass: 3.0361 3.4383 2.7271 3.3851 1.8762 2.3692 3.1124 2.3224 2.0777 1.9912 2.7239 3.0309 3.1211 3.2678 2.6533 1.8044 2.5706 2.6910 3.6621 3.0178 3.2731 1.4716 3.0144 3.3936 3.0260 2.3437 1.9325 1.6923 1.9598 1.4807 2.2613 2.4151 2.0244 2.7920 2.4727 2.2904 1.8705 1.2994 1.6415 1.5229 1.7349 1.7265 2.0121 1.9656 2.8673 2.1127 1.2655 1.4592 1.4985 1.6094 1.2672 1.3057 1.2993 1.2934 1.3018 1.4407 1.3303 1.2527 1.3705 1.3018 1.4207 1.4057 1.4643 1.4928 1.4845 1.5052 1.4373 1.4050 1.4761 1.0879 1.0836 1.0867 1.0895 1.0876 1.0906 1.0865 1.0920 1.0891 1.0801 1.0633 1.0626 1.0615 1.0640 1.0613 1.0621 1.0597 1.0590 1.0627 1.1001 1.0972 1.0956 1.1005 1.1007 1.1016 1.1025 1.1021 1.1031 1.0890 1.0899
irintensity: 0.0757 0.3860 0.3481 0.2520 0.3255 0.3462 2.3700 0.3887 0.7105 2.3798 0.1849 8.3133 1.4911 3.2773 1.5161 0.5055 1.3720 5.5737 9.8272 7.7560 46.4313 0.3516 5.8981 3.2936 2.4161 5.0233 10.5198 19.3941 0.9475 9.1996 3.9980 5.4268 9.6843 30.1938 17.8807 5.5165 13.7557 2.8730 1.2827 5.7329 9.7953 11.3650 32.0561 18.0245 26.3375 1.3660 2.9115 34.3722 2.6767 0.6329 5.9481 0.6052 2.6589 1.4009 0.5158 25.0109 1.0463 1.2796 3.9024 1.6756 7.3778 2.2782 6.5990 2.7985 0.2058 1.7397 1.9284 6.5198 15.6135 8.1932 6.2929 0.1754 9.5826 6.1651 22.8608 12.8027 1.1893 7.4748 75.9607 56.2313 30.5446 45.0595 36.7893 18.6309 30.5642 25.6634 43.7309 42.8176 32.4753 81.7475 70.4951 18.4253 24.9472 16.0390 53.3287 84.4338 79.1628 57.0886 32.5055
temp: 298.150 k
press: 1.00000 atm
elementType: 8 7 6 6 6 6 6 6 6 6 6 6 6 6 1 1 1 1 1 1 1 1 1 1 1 1 1 1 1 1 1 1 1 1 1
symmnumber: 1
zpe: 825285.0 jmol-1
zpe.correction: 0.314334 hartree
zpe.thermalcorrener: 0.326769 hartree
zpe.thermalcorrenthalpy: 0.327714 hartree
zpe.thermalcorrgfe: 0.275779 hartree
zpe.sumelectzpe: -598.709852 hartree
zpe.sumelectthermal: -598.697417 hartree
zpe.sumelectthermalent: -598.696473 hartree
zpe.sumelectthermalfe: -598.748408 hartree
dipole: -0.7530 -0.7042 1.1167
dipole: 1.5199
quadrupole: -84.7394 -82.6269 -90.9943
quadrupole: -2.3854 4.1981 0.7571
quadrupole: 1.3808 3.4933 -4.8741 -2.3854 4.1981 0.7571
hfenergy: -599.0241864 hartree
pointgroup: C01 [X(C12H21N1O1)]
dipole: -0.2988462 0.2649286 -0.4450413 debye
polarizability: 156.3432307|2.5404876|126.2639656|-2.0504837|-0.3793368|108.9768571 unknown
InChI: InChI=1S/C12H21NO/c1-2-5-10(6-3-1)13-9-11-7-4-8-12(13)14-11/h10-12H,1-9H2
charge 0 multiplicity 1
35 atoms
O  2.077002 -0.124432 1.50455
N  0.32763 0.10436 -0.097253
C  -1.110966 0.123538 0.309903
C  1.213632 -0.899841 0.557011
C  2.424872 1.044638 0.648395
C  1.043141 1.420521 0.042104
C  2.145503 -1.586736 -0.465883
C  3.46895 0.602435 -0.400603
C  -1.875108 1.187889 -0.520141
C  -1.770363 -1.260784 0.082316
C  2.886869 -0.515473 -1.306285
C  -3.381798 1.221157 -0.170766
C  -3.27715 -1.244844 0.435809
C  -4.035333 -0.165461 -0.369909
H  -1.213766 0.391274 1.395567
H  0.654029 -1.623416 1.169401
H  2.817582 1.823865 1.321612
H  0.505936 2.087895 0.747983
H  1.141656 1.940328 -0.928955
H  1.550947 -2.246502 -1.12553
H  2.864913 -2.216832 0.092937
H  4.357336 0.230572 0.144979
H  3.790484 1.469804 -1.010293
H  -1.741505 0.940987 -1.593382
H  -1.435187 2.190467 -0.361734
H  -1.266116 -2.04145 0.682434
H  -1.634187 -1.532916 -0.984034
H  2.162421 -0.07364 -2.016398
H  3.690435 -0.981762 -1.906218
H  -3.891721 1.98155 -0.79347
H  -3.509021 1.53631 0.885902
H  -3.397785 -1.04162 1.520333
H  -3.713479 -2.244904 0.248133
H  -5.100421 -0.136811 -0.068376
H  -4.010833 -0.429167 -1.447538
