program: Gaussian 09
title: 000265979
version: EM64L-G09RevD.01
frameworkgroup: C1[X(C11H22N2O)]
method: RPBEPBE
basis: SDD
operation: Freq
keyword: #p
keyword: freq=noraman
keyword: PBEPBE/SDD
title: #p freq=noraman PBEPBE/SDD
converged: YES YES NO NO
title: Mulliken charges:
elementType: O N N C C C C C C C C C C C H H H H H H H H H H H H H H H H H H H H H H
charge: -0.251356 -0.115652 -0.080617 -0.086032 -0.118412 -0.411995 -0.383783 -0.424492 -0.414121 -0.374427 -0.420817 -0.337559 -0.625302 -0.614476 0.220919 0.231100 0.213490 0.220721 0.200995 0.206721 0.221638 0.202360 0.225721 0.210209 0.204449 0.202063 0.221612 0.208079 0.161155 0.245507 0.218417 0.182397 0.233710 0.225342 0.183768 0.218670
chargesum: 0.00000
title: Mulliken charges with hydrogens summed into heavy atoms:
elementType: O N N C C C C C C C C C C C
charge: -0.251356 -0.115652 -0.080617 0.134887 0.112688 0.022216 0.023933 -0.000494 0.021808 0.032085 0.008874 0.069103 0.009222 0.013304
polarizability: 1.48819462e+02 -3.92907132e+00 1.23449558e+02 1.48354848e+00 1.82663215e-01 1.18682588e+02
1716.lowfreq: -14.3512 -9.4986 -0.0008 -0.0008 -0.0008 11.9116 30.1248 35.5946 39.9699
frequency: 30.1080 35.1698 39.2333 88.6628 125.2142 171.3342 208.8344 231.3304 241.8825 246.4041 256.8776 283.7427 336.1531 362.9566 387.1554 407.5641 420.9024 439.8621 486.1818 519.3415 590.4410 651.2728 728.4174 743.3450 794.2360 799.3504 802.3391 825.7846 851.3658 873.3505 883.1710 918.9716 946.1160 968.2877 979.3266 1000.0693 1025.1806 1033.9147 1036.3706 1074.7072 1078.0233 1081.1623 1093.2538 1098.1985 1116.0678 1119.9804 1150.6483 1151.4460 1166.5874 1186.2294 1195.7534 1218.8759 1238.9121 1253.9264 1263.8572 1264.8131 1287.4760 1293.0107 1296.4227 1309.4753 1320.6407 1329.8161 1337.9889 1345.8541 1352.1876 1365.0956 1378.3585 1417.2553 1441.3080 1444.6390 1453.9411 1459.7253 1460.7553 1463.0978 1471.6729 1473.1202 1476.9560 1481.4185 1486.0772 1488.5286 2808.7726 2835.4306 2853.0899 2880.8317 2965.7502 2984.8043 2987.0559 2989.4978 2997.0853 3011.7589 3015.0032 3025.0351 3028.8526 3029.5327 3039.7272 3049.2176 3050.4248 3060.1562 3063.0822 3070.3808 3074.8175 3083.9201
redmass: 3.1868 2.9443 3.5739 3.0060 2.4509 2.5023 2.2651 1.1886 1.5509 1.8665 1.9837 1.9527 2.2437 2.1833 2.2846 2.2233 3.3538 2.9074 3.1825 3.1147 2.5960 3.4336 2.9469 3.6545 1.5568 3.1883 2.9934 2.5542 2.7633 1.7007 2.0917 2.6309 1.9990 2.9955 2.4231 1.9928 2.0514 1.6449 2.0303 1.9104 1.7730 1.7981 1.5802 1.6135 1.8256 1.5359 1.3475 1.6444 1.7138 1.6426 1.5590 1.4018 1.3136 1.4147 1.9932 1.6313 1.4371 1.2682 1.3042 1.4517 1.3702 1.4026 1.4052 1.4288 1.4454 1.4513 1.3748 1.1439 1.1667 1.0890 1.0856 1.0569 1.0630 1.0812 1.0698 1.0841 1.0492 1.0804 1.0789 1.0755 1.0704 1.0577 1.0578 1.0687 1.0620 1.0596 1.0605 1.0591 1.0637 1.0909 1.0713 1.0728 1.0907 1.0966 1.0998 1.1024 1.1005 1.0891 1.1031 1.0913 1.1009 1.1001
irintensity: 0.4121 0.4041 0.2927 1.0219 1.1785 0.3176 1.4989 0.1860 0.5778 4.0552 0.6302 1.7319 9.3101 2.1411 2.8887 0.5096 7.9639 5.5696 1.0249 5.5272 3.8079 4.5978 9.3901 65.2684 9.3259 3.1875 10.2473 5.3792 7.3037 14.4242 1.3328 5.7004 9.6706 33.6115 30.7578 5.7822 13.3067 20.4463 34.1213 7.0735 1.2787 37.0201 6.8657 3.1382 23.4068 18.5635 0.7441 22.3521 23.8734 18.1217 0.6970 3.5404 7.4710 3.8599 2.5392 4.3168 8.5848 20.7919 18.9443 7.2512 4.5131 12.4122 5.2409 9.5042 3.3722 2.7852 1.8706 3.6892 2.0349 7.4977 7.3032 13.6893 23.4473 7.9230 4.3792 13.6399 14.0131 9.0251 11.3824 9.2130 68.9477 76.2426 235.4110 89.9260 41.9465 23.1589 30.7194 47.5341 33.6555 13.1530 41.5874 63.3770 5.8382 24.7903 36.1950 12.8373 49.2082 75.3946 82.2510 30.7234 37.0373 45.1744
temp: 298.150 k
press: 1.00000 atm
elementType: 8 7 7 6 6 6 6 6 6 6 6 6 6 6 1 1 1 1 1 1 1 1 1 1 1 1 1 1 1 1 1 1 1 1 1 1
symmnumber: 1
zpe: 843736.4 jmol-1
zpe.correction: 0.321362 hartree
zpe.thermalcorrener: 0.335996 hartree
zpe.thermalcorrenthalpy: 0.336940 hartree
zpe.thermalcorrgfe: 0.278751 hartree
zpe.sumelectzpe: -615.899309 hartree
zpe.sumelectthermal: -615.884675 hartree
zpe.sumelectthermalent: -615.883731 hartree
zpe.sumelectthermalfe: -615.941921 hartree
dipole: 1.0177 0.6561 0.0533
dipole: 1.2120
quadrupole: -89.6564 -87.0448 -85.0089
quadrupole: -5.6616 4.8995 0.8244
quadrupole: -2.4197 0.1919 2.2278 -5.6616 4.8995 0.8244
hfenergy: -616.2206715 hartree
pointgroup: C01 [X(C11H22N2O1)]
dipole: 0.4011998 0.2491866 0.0657947 debye
polarizability: 148.6445132|-4.3713917|123.414549|1.8872306|0.6344485|118.892546 unknown
InChI: InChI=1S/C11H22N2O/c1-12(2)7-4-8-13-9-10-5-3-6-11(13)14-10/h10-11H,3-9H2,1-2H3
charge 0 multiplicity 1
36 atoms
O  -2.901917 -1.095618 0.060448
N  -0.611853 -0.479333 0.171474
N  3.609862 0.462497 -0.172043
C  -1.854501 -0.538653 0.981997
C  -2.620535 -0.296658 -1.166598
C  -1.063213 -0.353552 -1.257712
C  -2.326945 0.857103 1.440308
C  -3.165066 1.133975 -0.962204
C  -2.43876 1.816829 0.227608
C  0.359089 -1.581361 0.400644
C  1.754583 -1.252708 -0.174884
C  2.39874 -0.038095 0.521667
C  4.733979 -0.494549 -0.14665
C  4.017607 1.79125 0.327383
H  -1.759735 -1.245864 1.82246
H  -3.115706 -0.817974 -2.001483
H  -0.748941 -1.24604 -1.836305
H  -0.643703 0.545052 -1.746166
H  -1.61717 1.261796 2.186263
H  -3.310603 0.736226 1.9343
H  -4.250213 1.058268 -0.759345
H  -3.037483 1.728343 -1.888303
H  -1.416641 2.105664 -0.083564
H  -2.963209 2.74632 0.516769
H  -0.001371 -2.543375 -0.039221
H  0.448676 -1.731116 1.494387
H  1.679325 -1.034812 -1.257777
H  2.387883 -2.155416 -0.0697
H  2.616997 -0.302228 1.592701
H  1.648533 0.773948 0.535528
H  5.589865 -0.073259 -0.70431
H  5.082515 -0.735826 0.891827
H  4.445546 -1.438946 -0.638407
H  3.177981 2.501212 0.221122
H  4.331553 1.786952 1.403518
H  4.865631 2.171048 -0.271233
