program: Gaussian 09
title: 000265923
version: EM64L-G09RevD.01
frameworkgroup: C1[X(C17H8N2O)]
method: RPBEPBE
basis: SDD
operation: Freq
keyword: #p
keyword: freq=noraman
keyword: PBEPBE/SDD
title: #p freq=noraman PBEPBE/SDD
converged: YES YES NO NO
title: Mulliken charges:
elementType: O N N C C C C C C C C C C C C C C C C C H H H H H H H H
charge: -0.179236 0.012441 0.012447 0.251779 0.251836 0.199077 0.222154 0.222148 -0.332843 -0.340098 -0.340108 -0.392182 -0.392180 0.158545 -0.243880 -0.243884 -0.226490 -0.226466 -0.263011 -0.263014 0.268073 0.268072 0.295516 0.295508 0.245925 0.245928 0.246974 0.246970
chargesum: 0.00000
title: Mulliken charges with hydrogens summed into heavy atoms:
elementType: O N N C C C C C C C C C C C C C C C C C
charge: -0.179236 0.012441 0.012447 0.251779 0.251836 0.199077 0.222154 0.222148 -0.332843 -0.072025 -0.072036 -0.096666 -0.096672 0.158545 0.002044 0.002044 0.020483 0.020504 -0.263011 -0.263014
polarizability: 2.84532897e+02 -3.78257912e-03 2.69015452e+02 -1.60817889e-03 6.84164179e+00 9.10393013e+01
1716.lowfreq: -8.3387 -5.7572 0.0007 0.0008 0.0010 4.6265 43.9283 52.5976 83.7926
frequency: 43.9280 52.5973 83.7896 85.0950 141.6973 156.3943 159.0219 206.8536 215.6152 242.0721 260.2349 327.4152 333.3306 375.3402 402.3830 416.6631 433.8874 437.0421 446.8221 463.3281 504.9272 564.9640 593.9748 611.1186 621.8246 648.1135 661.1326 672.8287 705.7814 732.6580 736.6558 772.7927 791.3081 829.9175 894.0143 895.4204 906.4503 916.7692 917.9369 979.9744 984.0597 1009.9769 1011.6389 1040.1499 1050.0639 1093.6026 1099.0246 1168.6411 1172.5593 1180.6009 1184.6882 1196.3127 1238.4836 1285.0773 1303.1580 1334.0203 1380.6763 1392.6112 1434.2476 1448.4482 1467.0916 1467.8062 1518.8042 1547.8444 1564.7869 1587.5207 1597.4890 1614.5542 2153.5108 2167.5516 3143.5635 3143.5891 3156.8073 3157.2059 3169.9323 3170.4281 3183.8002 3184.2907
redmass: 11.2915 7.8900 5.4123 5.9572 7.1948 8.6413 5.5788 6.3660 7.2529 7.0925 6.1798 7.8537 6.4920 6.1883 7.2501 4.2023 6.2528 9.4490 6.1952 4.8997 3.9264 5.9239 7.0676 10.9338 6.9504 7.5173 6.1700 4.7364 3.3399 6.3298 4.4098 1.2193 1.9772 2.5903 3.8178 1.5116 4.4631 2.1143 6.7838 1.3727 1.4132 1.3619 1.3755 2.4297 1.9482 2.2387 3.0758 8.7455 1.7723 1.0878 1.1900 3.0064 1.5590 1.4904 3.7111 2.5215 9.5120 9.6671 2.3147 2.8108 2.7700 2.6166 6.6614 9.5335 6.0937 7.2815 5.8844 7.0232 12.6398 12.6387 1.0866 1.0866 1.0910 1.0911 1.0968 1.0969 1.0970 1.0970
irintensity: 0.0577 5.5148 0.6842 1.4561 2.3455 2.4639 0.8839 1.2190 1.2447 6.0274 0.0084 9.5361 0.2887 0.1443 1.5096 0.6277 3.4390 0.1040 0.1926 2.4486 1.3355 2.8798 3.0375 1.1529 4.3343 2.3900 2.2695 12.7129 46.1716 9.9772 0.5090 1.5390 90.2932 11.2104 2.4100 0.0474 7.0427 1.0804 17.0863 0.9842 5.5864 0.1109 1.5747 0.1306 2.9801 4.2272 1.8150 7.7556 8.0606 1.7904 2.4974 1.1497 0.0042 1.3833 290.1506 34.4571 0.0045 8.7896 0.8010 7.0190 13.2591 0.0660 25.7413 190.8469 3.3515 27.4657 1.4399 0.5166 5.1435 27.3266 1.0751 2.7536 5.5631 0.4512 26.0838 4.6613 13.0834 2.8258
temp: 298.150 k
press: 1.00000 atm
elementType: 8 7 7 6 6 6 6 6 6 6 6 6 6 6 6 6 6 6 6 6 1 1 1 1 1 1 1 1
symmnumber: 1
zpe: 515869.8 jmol-1
zpe.correction: 0.196484 hartree
zpe.thermalcorrener: 0.211800 hartree
zpe.thermalcorrenthalpy: 0.212745 hartree
zpe.thermalcorrgfe: 0.153655 hartree
zpe.sumelectzpe: -835.995268 hartree
zpe.sumelectthermal: -835.979952 hartree
zpe.sumelectthermalent: -835.979008 hartree
zpe.sumelectthermalfe: -836.038097 hartree
dipole: -0.0003 -3.3447 3.3114
dipole: 4.7066
quadrupole: -94.6420 -138.3636 -116.6762
quadrupole: 0.0012 0.0029 3.6857
quadrupole: 21.9186 -21.8030 -0.1156 0.0012 0.0029 3.6857
hfenergy: -836.1917525 hartree
pointgroup: C01 [X(C17H8N2O1)]
dipole: 0.0017096 1.3028262 -1.3158688 debye
polarizability: 284.530212|-0.0559041|269.1346316|-0.6719365|5.0643703|90.922806 unknown
InChI: InChI=1S/C17H8N2O/c18-9-11(10-19)16-12-5-1-3-7-14(12)17(20)15-8-4-2-6-13(15)16/h1-8H
charge 0 multiplicity 1
28 atoms
O  0.019993 3.307093 1.010946
N  -2.134061 -3.568007 0.645065
N  2.101737 -3.588956 0.630474
C  1.262855 0.05376 -0.250346
C  -1.264999 0.066587 -0.24121
C  -0.004577 -0.710949 -0.134998
C  1.274984 1.430303 0.143916
C  -1.260237 1.44311 0.153217
C  0.012234 2.139526 0.507422
C  2.476104 -0.521592 -0.717973
C  -2.487348 -0.496359 -0.70015
C  2.484224 2.165636 0.144815
C  -2.461969 2.190616 0.163033
C  -0.010353 -2.079166 0.174576
C  3.669384 0.22838 -0.742593
C  -3.673125 0.265671 -0.71605
C  3.683921 1.568806 -0.287459
C  -3.670757 1.60604 -0.260581
C  -1.200566 -2.854785 0.414754
C  1.173715 -2.866639 0.406475
H  2.493407 -1.546006 -1.096144
H  -2.517733 -1.520484 -1.078294
H  2.447636 3.207801 0.477438
H  -2.412513 3.232319 0.495447
H  4.587409 -0.235697 -1.117264
H  -4.598486 -0.189005 -1.08415
H  4.616633 2.141875 -0.290753
H  -4.59762 2.188524 -0.257015
