program: Gaussian 09
title: 000265930
version: EM64L-G09RevD.01
frameworkgroup: C1[X(C12H17ClN2O4)]
method: RPBEPBE
basis: SDD
operation: Freq
keyword: #p
keyword: freq=noraman
keyword: PBEPBE/SDD
title: #p freq=noraman PBEPBE/SDD
converged: YES YES NO NO
title: Mulliken charges:
elementType: Cl O O O O N N C C C C C C C C C C C C H H H H H H H H H H H H H H H H H
charge: -0.070315 -0.294119 -0.291022 -0.272842 -0.280976 -0.505386 -0.430378 0.609459 0.019352 0.302691 0.315117 -0.541389 -0.681778 0.289295 -0.321857 -0.553612 -0.518233 -0.525603 -0.534256 0.330287 0.229881 0.288877 0.234678 0.271783 0.289373 0.249650 0.304395 0.226760 0.220818 0.248050 0.214226 0.263542 0.226524 0.223433 0.216367 0.247206
chargesum: 0.00000
title: Mulliken charges with hydrogens summed into heavy atoms:
elementType: Cl O O O O N N C C C C C C C C C C C C
charge: -0.070315 -0.294119 -0.291022 -0.272842 -0.280976 -0.216509 -0.141005 0.609459 0.019352 0.302691 0.315117 -0.211102 -0.451897 0.289295 0.184605 0.000433 0.177395 0.178688 0.152750
polarizability: 2.70234042e+02 -1.37968316e+00 1.83424537e+02 1.15764119e+01 -6.45585155e-01 9.90283728e+01
1716.lowfreq: -6.9200 -0.0017 -0.0016 -0.0013 0.7447 6.9423 19.8650 24.6898 46.7330
frequency: 19.6300 24.6661 46.7311 59.6186 70.1550 72.5964 79.6338 91.7291 102.9128 109.3358 149.7878 160.9261 163.6099 191.8723 201.5692 203.2518 232.6552 243.6951 262.0928 275.6424 290.1690 302.9693 327.9833 339.9821 381.9298 406.8716 440.4040 490.9975 507.9398 563.5170 588.6678 613.1609 634.2062 643.6221 689.5944 706.9297 715.5625 746.4112 760.7432 791.8326 819.7304 869.4785 912.1975 917.8969 948.4496 955.1966 1011.3046 1031.0205 1048.7131 1070.9901 1101.5136 1108.7029 1110.3922 1112.1537 1145.9910 1154.0568 1159.7130 1161.9458 1173.9848 1197.9380 1217.2577 1227.8032 1258.9745 1301.9875 1313.9467 1366.2997 1375.5479 1399.3927 1421.9270 1433.0615 1439.5173 1444.3282 1454.2979 1456.7259 1458.1290 1466.3509 1468.6045 1475.3886 1478.0612 1484.1956 1486.7986 1513.7184 1593.6531 1612.6371 1642.1165 2956.5711 2973.3636 2975.9115 3029.9829 3044.2300 3061.1938 3078.3471 3080.0042 3098.2120 3119.2695 3123.3467 3124.9191 3138.1300 3154.9758 3208.1784 3531.2873 3556.4692
redmass: 4.7378 7.1450 4.4582 4.1489 3.3418 2.8579 2.9722 3.3111 4.1234 3.7858 1.3161 1.2897 2.6731 2.6925 4.2164 2.0202 3.0272 3.3410 4.0170 1.8042 3.5660 3.9019 4.8187 2.1588 4.3702 6.7509 5.5399 5.3759 6.1826 1.3382 5.4520 3.9399 3.8164 3.6316 5.6248 8.4989 2.8566 4.8240 2.8799 1.4651 2.2794 6.9491 1.6426 4.6559 6.8464 5.3528 4.6227 1.4853 4.2145 6.1900 2.9946 1.2395 1.2466 1.2583 1.7926 1.3806 1.4607 1.4017 2.4503 1.8928 1.6117 1.9256 1.1683 1.1551 3.8865 1.3155 3.4916 3.2305 1.2525 1.3371 1.2157 1.1582 1.1485 1.0967 1.0633 1.0646 1.3243 1.4649 1.0550 1.3405 1.5034 2.3942 5.9231 6.2132 4.5737 1.0331 1.0333 1.0310 1.0605 1.1038 1.0572 1.1025 1.0996 1.1044 1.1033 1.0991 1.1043 1.0904 1.1121 1.0927 1.0762 1.0778
irintensity: 1.4600 0.0580 8.7660 1.3747 3.3206 8.5038 11.4992 3.6500 1.1343 5.1119 0.7157 1.0078 5.0732 1.3884 1.3004 0.9899 0.7195 3.1029 5.7247 0.2170 17.1932 4.7716 3.3115 46.8488 10.3295 17.4580 17.4810 6.3643 8.5063 131.6106 14.2841 9.4252 0.8082 11.6693 51.2118 38.1068 6.1898 1.1327 30.2434 6.0122 30.5715 9.3011 34.4826 22.5784 38.1654 26.6025 40.5659 1.3229 0.7061 264.5662 16.0988 12.0295 1.9164 0.3971 17.0841 5.0550 36.6451 23.6910 18.4352 68.6943 381.2061 133.2714 5.0732 13.5642 125.0641 2.4383 54.3176 58.9723 31.1141 19.5288 1.2378 16.9180 77.2663 35.9409 11.2131 33.0928 289.2644 159.4732 10.2598 12.0433 116.1396 545.7377 238.7423 111.5875 110.5636 64.4742 98.4075 69.1442 24.2734 48.3460 20.3093 32.0615 31.3029 3.5181 25.3092 23.4423 17.8745 12.3652 9.6029 14.4847 6.2456 18.1263
temp: 298.150 k
press: 1.00000 atm
elementType: 17 8 8 8 8 7 7 6 6 6 6 6 6 6 6 6 6 6 6 1 1 1 1 1 1 1 1 1 1 1 1 1 1 1 1 1
symmnumber: 1
zpe: 740261.7 jmol-1
zpe.correction: 0.281951 hartree
zpe.thermalcorrener: 0.303467 hartree
zpe.thermalcorrenthalpy: 0.304411 hartree
zpe.thermalcorrgfe: 0.228858 hartree
zpe.sumelectzpe: -1336.442666 hartree
zpe.sumelectthermal: -1336.421149 hartree
zpe.sumelectthermalent: -1336.420205 hartree
zpe.sumelectthermalfe: -1336.495758 hartree
dipole: 2.2204 -7.5036 0.1265
dipole: 7.8262
quadrupole: -131.6908 -100.5153 -118.7256
quadrupole: 10.5602 5.3509 -1.5172
quadrupole: -14.7136 16.4619 -1.7484 10.5602 5.3509 -1.5172
hfenergy: -1336.7246164 hartree
pointgroup: C01 [X(C12H17Cl1N2O4)]
dipole: 0.8614097 2.9555749 -0.057435 debye
polarizability: 270.5798923|1.7053926|183.4227201|-8.5139616|-1.3268807|98.68434 unknown
InChI: InChI=1S/C12H17ClN2O4/c1-17-9-6-8(15-12(16)14-5-4-13)7-10(18-2)11(9)19-3/h6-7,14-15H,4-5H2,1-3H3
charge 0 multiplicity 1
36 atoms
Cl -7.367412 -0.662966 -0.677077
O  3.931939 -0.85191 -0.096824
O  1.742743 -2.70127 -0.07257
O  3.399201 1.8753 0.008197
O  -2.714695 -0.977161 0.384525
N  -1.423964 1.006258 0.283245
N  -3.766922 1.102974 0.361772
C  -0.099036 0.48849 0.190767
C  2.603989 -0.382857 -0.020035
C  1.534295 -1.315705 0.043282
C  2.29332 1.00745 0.052682
C  0.18985 -0.892341 0.151449
C  0.954371 1.442826 0.147984
C  -2.626094 0.285871 0.343223
C  -5.10128 0.499694 0.4867
C  -5.618527 0.023976 -0.882573
C  4.64883 -0.515722 -1.346801
C  2.646708 -3.324984 0.919235
C  3.1407 3.309408 0.141116
H  -0.606534 -1.634997 0.199296
H  0.721868 2.51225 0.193202
H  -1.485765 2.024654 0.336674
H  -5.79508 1.239681 0.922424
H  -5.035816 -0.364582 1.168276
H  -3.697299 2.112525 0.231509
H  -5.703624 0.843444 -1.612167
H  -5.008082 -0.80067 -1.275873
H  5.633598 -0.999357 -1.254936
H  4.107258 -0.923003 -2.221464
H  4.767273 0.577425 -1.440861
H  2.215742 -3.229706 1.934722
H  3.647622 -2.864592 0.883601
H  2.694087 -4.386755 0.63279
H  2.643956 3.539143 1.103844
H  2.524808 3.690449 -0.697424
H  4.133074 3.783058 0.11519
