program: Gaussian 09
title: 000265965
version: EM64L-G09RevD.01
frameworkgroup: C1[X(C15H19Cl2N7)]
method: RPBEPBE
basis: SDD
operation: Freq
keyword: #p
keyword: freq=noraman
keyword: PBEPBE/SDD
title: #p freq=noraman PBEPBE/SDD
converged: YES YES NO NO
title: Mulliken charges:
elementType: Cl Cl N N N N N N N C C C C C C C C C C C C C C C H H H H H H H H H H H H H H H H H H H
charge: -0.065374 -0.065061 -0.129547 -0.084546 -0.133185 -0.110728 -0.640705 -0.618848 -0.591540 0.452120 -0.419651 -0.420069 -0.371933 -0.349760 -0.555082 -0.555384 0.476966 -0.417596 -0.422238 -0.436203 -0.022840 0.180463 0.123598 -0.010756 0.237102 0.274503 0.237233 0.273748 0.220276 0.219749 0.263322 0.290449 0.263588 0.291728 0.219816 0.248934 0.195715 0.319826 0.325220 0.340968 0.317296 0.325112 0.323314
chargesum: 0.00000
title: Mulliken charges with hydrogens summed into heavy atoms:
elementType: Cl Cl N N N N N N N C C C C C C C C C C C C C C C
charge: -0.065374 -0.065061 -0.129547 -0.084546 -0.133185 -0.110728 0.004342 0.039416 0.056886 0.452120 0.091954 0.090912 -0.151658 -0.130011 -0.001310 -0.000069 0.476966 -0.197780 -0.173304 -0.240488 -0.022840 0.180463 0.123598 -0.010756
polarizability: 5.70819292e+02 -7.07683959e+00 2.11867906e+02 -8.25617438e+00 3.55717340e+01 1.52923070e+02
1716.lowfreq: -7.9239 -2.1071 -0.0017 0.0013 0.0016 4.2125 16.5216 17.8656 30.1939
frequency: 16.0465 17.8166 30.1336 32.9085 42.8438 68.4190 80.4085 82.5220 92.0132 107.0344 137.9207 156.3210 178.5077 200.4914 208.0486 209.4582 235.5927 252.0792 306.1118 321.9460 327.1012 335.0537 377.8559 401.3637 409.3340 416.2231 420.7134 430.0204 433.0003 453.7351 489.1869 506.6625 513.6863 525.8273 529.6166 551.6604 557.5871 564.1276 573.0021 599.4606 604.5320 631.5417 635.8356 638.5604 668.3998 690.4235 711.0900 736.3217 779.3047 786.3406 806.2302 820.1464 848.2436 866.0133 870.0728 917.3649 919.8913 929.6804 946.9980 952.3962 957.0317 970.6171 993.7128 1007.7689 1028.9373 1048.9411 1118.8299 1125.5184 1132.6914 1141.1287 1163.0309 1173.8378 1179.5307 1184.7376 1201.3378 1232.4511 1259.8844 1266.3747 1295.6867 1305.7945 1315.0128 1341.9451 1348.7911 1352.5712 1359.9796 1386.8196 1389.7986 1426.0526 1436.6573 1440.6521 1442.8141 1452.4357 1467.4503 1484.5259 1493.0961 1510.1993 1519.9768 1542.5413 1552.2237 1577.2900 1588.3358 1600.4189 1619.1889 1628.5137 2952.5546 2974.5450 2977.5971 3055.0254 3055.3075 3073.9078 3080.3057 3111.1503 3140.2326 3144.2405 3144.5273 3158.5594 3164.4295 3519.3561 3533.4790 3564.9080 3691.0229 3693.8784 3726.1216
redmass: 9.1127 6.6732 8.0245 7.5158 8.1894 5.9959 5.4011 5.9083 4.2931 3.5150 4.6633 5.2708 5.0673 4.6820 5.2208 6.7940 4.7387 4.6036 2.9751 3.0337 3.1108 2.6399 3.1254 3.1197 2.8083 3.0675 1.4260 1.2926 3.2498 2.9056 1.2935 2.5730 2.4782 1.1133 4.7644 1.3806 2.4985 4.3984 3.5798 4.7408 4.3081 5.3156 2.5851 1.5429 6.3515 4.0302 8.9557 3.7589 9.7216 6.8108 1.3244 1.6905 3.4821 2.6349 1.8123 2.0971 1.8621 1.7399 2.1504 1.7464 1.6485 1.3713 2.8696 1.8515 2.6772 1.8128 2.1424 1.8551 1.7903 3.0745 1.1548 1.4447 1.9535 2.1926 1.4998 1.3361 1.5010 1.7908 1.2472 1.1939 1.5549 5.5546 1.6475 1.5565 1.8049 1.8112 2.5536 4.4091 2.0553 1.1101 1.3481 3.8929 1.1572 2.0191 1.1731 3.9257 2.7717 4.2406 6.0003 2.9632 2.9665 1.4379 1.6378 5.5039 1.0843 1.0687 1.0689 1.0582 1.0579 1.0931 1.0927 1.0889 1.0884 1.1093 1.1088 1.0931 1.0950 1.0444 1.0448 1.0438 1.1039 1.1040 1.1059
irintensity: 0.0314 0.0470 0.5010 1.1251 0.5622 2.3406 1.6885 3.2145 4.2784 2.3538 2.3468 2.3424 5.4538 9.7950 11.4475 1.7200 1.7045 11.5061 10.7131 11.7535 4.8406 9.0792 3.3895 9.2610 10.1799 2.6701 61.7335 305.5805 27.9603 44.1135 170.5125 18.0504 33.2856 12.2115 3.3167 145.8967 36.9046 7.8682 1.2751 15.7401 24.8753 6.5985 9.6889 31.0001 9.1197 4.1743 4.5833 0.8338 35.1005 8.2172 7.5204 42.0922 14.5449 23.1224 0.3444 13.0868 90.5439 3.3642 7.4217 12.5978 20.5318 4.1194 2.8883 3.9044 20.6757 7.3266 3.6781 1.9257 5.8378 13.8559 11.1473 20.6632 54.6814 5.7971 82.9287 147.4009 6.1443 16.8630 7.4043 25.3405 14.6935 18.6004 13.5383 419.5344 2.8814 46.8906 29.8183 2.8192 9.4570 1.6845 15.6368 7.2432 29.3563 132.4821 4.3169 231.5955 590.0791 437.2445 112.0199 370.3663 432.9495 690.7393 316.7712 213.7372 71.6090 42.4220 34.7466 33.7570 5.1506 1.7679 8.4823 18.0846 22.5245 15.1120 27.4277 32.7212 25.1885 40.9030 43.7926 223.5381 30.7912 80.8412 43.3805
temp: 298.150 k
press: 1.00000 atm
elementType: 17 17 7 7 7 7 7 7 7 6 6 6 6 6 6 6 6 6 6 6 6 6 6 6 1 1 1 1 1 1 1 1 1 1 1 1 1 1 1 1 1 1 1
symmnumber: 1
zpe: 883905.8 jmol-1
zpe.correction: 0.336662 hartree
zpe.thermalcorrener: 0.360513 hartree
zpe.thermalcorrenthalpy: 0.361458 hartree
zpe.thermalcorrgfe: 0.279957 hartree
zpe.sumelectzpe: -1884.645122 hartree
zpe.sumelectthermal: -1884.621271 hartree
zpe.sumelectthermalent: -1884.620327 hartree
zpe.sumelectthermalfe: -1884.701827 hartree
dipole: 0.8881 -1.0632 -0.0759
dipole: 1.3874
quadrupole: -152.5430 -141.4382 -158.6129
quadrupole: 1.3065 -2.2644 18.0567
quadrupole: -1.6783 9.4265 -7.7482 1.3065 -2.2644 18.0567
hfenergy: -1884.9817841 hartree
pointgroup: C01 [X(C15H19Cl2N7)]
dipole: 0.3494038 -0.4137538 -0.0684357 debye
polarizability: 570.8882914|-6.775663|204.4671354|-6.7568503|40.5606544|160.2548416 unknown
InChI: InChI=1S/C15H19Cl2N7/c16-5-7-24(8-6-17)11-3-1-10(2-4-11)9-21-12-13(18)22-15(20)23-14(12)19/h1-4,9H,5-8,18-20H2
charge 0 multiplicity 1
43 atoms
Cl 6.587231 -2.238014 1.260973
Cl 6.175865 2.7911 -0.843459
N  4.494598 0.052827 0.032915
N  -2.084621 0.135848 0.08899
N  -5.69263 -0.956761 -0.354887
N  -5.552423 1.302962 0.581298
N  -3.829321 -2.265867 -0.778657
N  -3.46237 2.267432 1.019808
N  -7.607079 0.306848 0.085732
C  3.103286 -0.106205 -0.107543
C  5.433262 -0.696287 -0.813758
C  5.059086 0.979968 1.023663
C  2.544007 -0.991534 -1.084116
C  2.180188 0.609408 0.726533
C  5.65441 -2.15497 -0.387017
C  5.012792 2.459768 0.615597
C  0.239591 -0.421297 -0.395189
C  1.153235 -1.137274 -1.217414
C  0.795428 0.449192 0.585318
C  -1.204992 -0.596614 -0.567244
C  -3.478732 0.051237 0.039614
C  -4.324764 -1.038285 -0.374137
C  -4.190652 1.20482 0.553606
C  -6.232324 0.215503 0.099868
H  5.079207 -0.699102 -1.865065
H  6.399458 -0.165562 -0.824609
H  4.525121 0.877527 1.990572
H  6.102299 0.685862 1.224877
H  3.190644 -1.57048 -1.749602
H  2.544795 1.292381 1.49935
H  6.290952 -2.694821 -1.105598
H  4.713984 -2.695516 -0.209237
H  5.373231 3.113122 1.425643
H  4.020047 2.776789 0.26612
H  0.763293 -1.820762 -1.983277
H  0.108027 0.994964 1.240166
H  -1.489752 -1.340429 -1.339629
H  -2.851606 -2.515913 -0.664011
H  -4.520484 -2.994043 -0.953446
H  -2.446511 2.179815 1.002921
H  -3.945133 3.079422 1.393889
H  -8.046928 1.159707 0.418771
H  -8.152014 -0.479563 -0.255031
