program: Gaussian 09
title: 000265940
version: EM64L-G09RevD.01
frameworkgroup: C1[X(C17H10ClN3O2)]
method: RPBEPBE
basis: SDD
operation: Freq
keyword: #p
keyword: freq=noraman
keyword: PBEPBE/SDD
title: #p freq=noraman PBEPBE/SDD
converged: YES YES NO NO
title: Mulliken charges:
elementType: Cl O O N N N C C C C C C C C C C C C C C C C C H H H H H H H H H H
charge: 0.039556 -0.218586 -0.190990 -0.485557 -0.451754 0.000570 0.470134 0.342224 0.266124 0.525897 -0.198274 0.330867 0.184751 -0.479351 -0.574229 0.069256 -0.464448 -0.344747 -0.365563 -0.366235 -0.442169 -0.229425 -0.220898 0.351510 0.283711 0.242422 0.246828 0.289628 0.296129 0.333367 0.272488 0.243321 0.243443
chargesum: 0.00000
title: Mulliken charges with hydrogens summed into heavy atoms:
elementType: Cl O O N N N C C C C C C C C C C C C C C C C C
charge: 0.039556 -0.218586 -0.190990 -0.134047 -0.118387 0.000570 0.470134 0.342224 0.266124 0.525897 -0.198274 0.330867 0.184751 -0.195640 -0.574229 0.069256 -0.222026 -0.097919 -0.075935 -0.070106 -0.169681 0.013897 0.022545
polarizability: 4.58885216e+02 1.31924267e+01 2.30648377e+02 -1.03373317e+01 -1.28160915e+01 1.16901810e+02
1716.lowfreq: -2.5264 -0.0022 -0.0017 -0.0013 4.1382 4.4343 25.6601 39.5139 46.1113
frequency: 25.6522 39.4546 46.0990 65.9601 98.7555 130.6243 155.3114 171.3001 191.5166 210.4723 234.7773 248.3550 277.0418 290.1054 337.1795 354.3468 376.3207 406.4955 420.0617 433.7752 445.1304 457.4816 486.0637 520.9737 545.3678 555.6400 584.5465 614.5424 631.1074 639.6844 665.3923 680.3515 705.5868 724.1969 737.8219 750.2102 758.7146 788.6744 803.0281 808.1600 823.9889 828.7958 844.9534 863.7568 884.4785 913.8081 926.1193 957.5174 961.5037 994.5506 1002.7036 1014.1047 1039.6130 1041.3534 1081.9494 1128.4597 1138.7961 1155.6012 1173.2437 1200.1897 1234.3189 1239.1096 1243.5703 1270.7530 1292.3128 1295.1098 1322.1377 1344.5743 1385.4069 1401.5473 1424.6579 1441.8918 1468.3735 1479.6264 1499.7771 1512.2468 1522.1536 1561.6372 1581.7046 1590.6099 1603.5606 1610.2564 1638.4077 3137.1456 3140.2957 3154.7388 3162.4555 3165.6256 3174.9451 3175.5700 3226.7470 3360.7896 3625.2314
redmass: 7.6360 5.4692 7.7141 11.1834 7.7751 5.5043 7.2699 7.4289 8.9977 8.3705 5.8207 4.8815 7.2231 9.5058 10.2761 5.8396 10.7028 5.3546 3.7735 3.2488 4.1633 8.9752 7.6383 6.2170 6.9198 1.5694 6.9242 6.5172 4.0654 2.4703 6.3238 4.5043 5.2684 2.9896 1.8448 3.1138 2.9587 6.5693 1.7208 1.5414 3.7437 4.2569 1.5752 1.6614 4.4466 4.0049 1.5463 1.4135 2.9597 1.3927 5.8897 1.3657 4.6748 2.2423 2.8868 2.5357 1.5070 2.5748 1.0868 1.4641 2.4649 2.3132 1.8215 2.1661 4.4645 2.7674 3.5480 1.8108 3.5709 9.9359 2.8646 2.5463 2.7596 4.6906 2.7525 3.3284 8.8903 4.4606 7.8905 4.1799 7.1321 8.6987 6.8940 1.0879 1.0865 1.0904 1.0973 1.0947 1.1004 1.0931 1.0978 1.0738 1.0822
irintensity: 0.3213 0.0114 0.3787 4.4294 2.1749 0.0490 0.6274 0.1998 0.0849 2.4474 0.8990 0.0146 0.1940 0.6768 1.0938 0.9316 36.9219 2.1918 1.6287 8.1154 3.9842 3.1908 2.1775 2.6926 20.5242 55.1683 6.9546 9.6107 21.2321 50.8571 6.0290 4.3350 22.6543 61.4638 31.5465 7.5383 15.7148 20.8858 46.7896 2.9830 17.6755 8.2766 62.0774 23.0254 35.8692 56.2537 0.2862 1.0123 12.0472 3.7334 60.1856 0.5463 8.8818 2.5080 0.3072 54.0302 3.1014 30.0354 12.2964 0.0243 14.6187 47.1811 5.1155 41.5637 418.7340 135.9275 12.6807 10.2499 32.1045 0.8041 3.1611 15.5726 6.8895 15.9919 232.4477 20.4302 350.0644 89.0491 130.2533 24.2618 52.5022 223.6775 9.4860 3.2849 4.3741 6.3642 14.9582 1.0682 29.6817 1.1349 4.6260 84.6977 73.4419
temp: 298.150 k
press: 1.00000 atm
elementType: 17 8 8 7 7 7 6 6 6 6 6 6 6 6 6 6 6 6 6 6 6 6 6 1 1 1 1 1 1 1 1 1 1
symmnumber: 1
zpe: 614157.1 jmol-1
zpe.correction: 0.233920 hartree
zpe.thermalcorrener: 0.251648 hartree
zpe.thermalcorrenthalpy: 0.252592 hartree
zpe.thermalcorrgfe: 0.186995 hartree
zpe.sumelectzpe: -1427.009448 hartree
zpe.sumelectthermal: -1426.991720 hartree
zpe.sumelectthermalent: -1426.990776 hartree
zpe.sumelectthermalfe: -1427.056373 hartree
dipole: -2.2994 3.0245 1.1734
dipole: 3.9764
quadrupole: -121.2759 -145.1743 -138.2729
quadrupole: 2.6750 -10.8992 -8.5094
quadrupole: 13.6318 -10.2666 -3.3652 2.6750 -10.8992 -8.5094
hfenergy: -1427.2433682 hartree
pointgroup: C01 [X(C17H10Cl1N3O2)]
dipole: 0.7716782 -1.0542345 -0.8605474 debye
polarizability: 457.5793209|-27.8320046|135.6022901|6.4751557|41.5545537|213.253791 unknown
InChI: InChI=1S/C17H10ClN3O2/c18-14-15(17(23)12-4-2-1-3-11(12)16(14)22)20-10-6-5-9-8-19-21-13(9)7-10/h1-8,20-21H
charge 0 multiplicity 1
33 atoms
Cl -0.209106 2.082436 1.176023
O  1.423696 -1.367226 -2.333235
O  2.544567 1.543795 2.186484
N  -0.590805 -0.123398 -1.213762
N  -4.349768 -0.19343 2.100383
N  -5.732699 -0.047269 1.953714
C  0.614408 0.037665 -0.562742
C  3.061757 -0.770914 -0.655413
C  3.323495 -0.033378 0.531906
C  -1.934954 0.005184 -0.767162
C  1.712323 -0.74969 -1.256081
C  -3.668285 -0.080102 0.895349
C  -4.681355 0.152319 -0.100509
C  -2.29417 -0.174288 0.586355
C  0.94504 0.850597 0.52138
C  2.2699 0.840088 1.160752
C  -2.929617 0.233577 -1.779847
C  -4.290371 0.302763 -1.458986
C  4.086095 -1.546199 -1.254159
C  4.609368 -0.082876 1.114629
C  -5.925348 0.160425 0.6242
C  5.366457 -1.592557 -0.666438
C  5.626529 -0.861742 0.519797
H  -0.458688 -0.602346 -2.120736
H  -1.54414 -0.39539 1.348755
H  -2.599562 0.371229 -2.815613
H  -5.035042 0.478982 -2.24147
H  3.855866 -2.103335 -2.167569
H  4.787776 0.50094 2.022674
H  -3.975908 -0.344216 3.033965
H  -6.937016 0.305134 0.249772
H  6.158629 -2.193712 -1.12431
H  6.62173 -0.897368 0.975594
