program: Gaussian 09
title: 000265932
version: EM64L-G09RevD.01
frameworkgroup: C1[X(C12H15ClN2O)]
method: RPBEPBE
basis: SDD
operation: Freq
keyword: #p
keyword: freq=noraman
keyword: PBEPBE/SDD
title: #p freq=noraman PBEPBE/SDD
converged: YES YES NO NO
title: Mulliken charges:
elementType: Cl O N N C C C C C C C C C C C C H H H H H H H H H H H H H H H
charge: -0.087279 -0.309116 -0.428540 -0.406629 -0.227204 -0.125384 -0.584408 0.431431 -0.408613 -0.443720 0.312341 -0.232021 -0.225680 -0.240930 -0.329967 -0.550894 0.263546 0.278678 0.234644 0.237963 0.286689 0.298657 0.235664 0.224292 0.221744 0.294452 0.224754 0.267825 0.241749 0.266404 0.279554
chargesum: 0.00000
title: Mulliken charges with hydrogens summed into heavy atoms:
elementType: Cl O N N C C C C C C C C C C C C
charge: -0.087279 -0.309116 -0.141851 -0.112177 0.036342 0.153294 -0.111802 0.431431 -0.109956 -0.208056 0.312341 -0.007729 -0.003936 -0.016176 0.179607 -0.004936
polarizability: 2.06854202e+02 -1.12508361e+01 1.55420962e+02 -5.64433056e+00 -9.68198175e+00 8.97540729e+01
1716.lowfreq: -6.6386 -3.1484 -0.0016 -0.0007 -0.0004 6.8915 9.7039 32.0401 41.4172
frequency: 8.5572 31.8845 41.4097 50.0403 75.3216 77.6875 109.0235 123.9844 160.7543 230.5167 252.5617 298.8651 341.5161 348.0161 378.4583 407.4534 411.8711 458.2765 483.5173 517.2248 549.0071 581.7871 597.7179 615.8528 689.0837 709.9472 715.1121 738.1916 779.0455 829.1760 837.4897 864.5007 899.6719 929.7195 935.5988 960.9936 976.1055 985.5842 989.5264 1001.7006 1008.0706 1028.4755 1044.7100 1068.9255 1073.2262 1084.2459 1092.0812 1130.7632 1156.8747 1170.3861 1177.8138 1188.0485 1212.0279 1232.8631 1240.4914 1256.7980 1297.9194 1315.5424 1320.8291 1367.9796 1375.5508 1401.1749 1434.0206 1438.1411 1440.5184 1450.0324 1457.1456 1490.8746 1502.5503 1587.3758 1615.8006 1625.1244 2990.6496 3049.0899 3064.6572 3093.4202 3099.7032 3104.7747 3116.1859 3122.3693 3133.3570 3142.9795 3153.8145 3159.2710 3201.4452 3531.3778 3545.9477
redmass: 8.0995 4.2483 5.4076 4.6486 6.4465 4.7950 3.5868 4.1610 4.4960 5.7626 3.8130 3.2263 1.7900 3.5019 1.8080 2.8848 3.0536 2.7439 3.2265 2.8290 1.3615 3.4225 3.7090 6.3355 4.4600 2.0281 9.1133 2.2224 1.8393 1.9270 2.0399 1.2683 3.0245 1.6145 2.3315 2.1952 2.1704 1.3987 5.0677 2.2927 1.3639 2.0646 2.0443 1.3321 1.1064 1.4820 1.8924 2.0339 1.6891 1.0572 1.9658 1.1316 1.4779 1.4793 1.4862 1.7481 1.1827 1.4756 1.3434 1.2927 7.1002 1.6902 2.1632 1.1950 1.1917 1.4601 1.3568 2.6004 2.3538 6.1398 5.9557 5.4700 1.0596 1.0972 1.0615 1.0754 1.0723 1.0859 1.0847 1.0879 1.0926 1.0967 1.1120 1.1016 1.1157 1.0773 1.0770
irintensity: 0.3962 0.4706 0.4348 0.7558 16.0620 4.6815 5.8260 2.3917 0.2893 7.8738 0.4138 2.1250 18.4359 7.7876 10.6040 0.0645 7.4528 5.8242 13.0439 7.8107 210.6220 11.6709 42.4867 0.8538 8.5519 42.0979 19.8976 15.1967 38.8591 2.0239 21.1112 0.9121 9.1355 1.3617 10.6716 9.3188 5.6891 0.0278 1.4575 1.4172 0.6379 16.0807 3.1164 15.8701 7.4990 7.9045 1.0621 2.1446 1.5183 0.1152 5.6043 4.6069 40.9274 1.0952 202.7692 81.8330 47.9322 10.0693 5.6934 4.1969 0.4375 4.1673 3.1647 32.7528 37.7744 40.7499 30.0261 79.2744 494.2280 1.2125 7.4489 164.0741 56.7359 6.3861 21.5028 9.1765 18.4507 15.0304 2.8303 7.3013 12.5849 29.9063 17.1057 36.7492 16.4276 15.4944 24.8062
temp: 298.150 k
press: 1.00000 atm
elementType: 17 8 7 7 6 6 6 6 6 6 6 6 6 6 6 6 1 1 1 1 1 1 1 1 1 1 1 1 1 1 1
symmnumber: 1
zpe: 656679.1 jmol-1
zpe.correction: 0.250116 hartree
zpe.thermalcorrener: 0.266022 hartree
zpe.thermalcorrenthalpy: 0.266966 hartree
zpe.thermalcorrgfe: 0.202761 hartree
zpe.sumelectzpe: -1109.867056 hartree
zpe.sumelectthermal: -1109.851150 hartree
zpe.sumelectthermalent: -1109.850205 hartree
zpe.sumelectthermalfe: -1109.914410 hartree
dipole: -0.9813 1.8686 0.4983
dipole: 2.1686
quadrupole: -102.8600 -91.0133 -104.3501
quadrupole: 4.9215 -4.0230 1.9644
quadrupole: -3.4522 8.3945 -4.9423 4.9215 -4.0230 1.9644
hfenergy: -1110.1171715 hartree
pointgroup: C01 [X(C12H15Cl1N2O1)]
dipole: -0.3881209 -0.757693 -0.0566905 debye
polarizability: 206.9590654|11.2787407|150.4818376|-0.6653978|-20.3149495|94.5883336 unknown
InChI: InChI=1S/C12H15ClN2O/c13-6-7-14-12(16)15-11-8-10(11)9-4-2-1-3-5-9/h1-5,10-11,14-15H,6-8H2
charge 0 multiplicity 1
31 atoms
Cl -6.09386 -0.129758 1.096655
O  -1.312411 0.898097 -0.774478
N  -1.282343 -1.429421 -0.484439
N  -3.330132 -0.272113 -0.555749
C  1.012964 -0.98848 0.586466
C  0.156826 -1.517166 -0.573521
C  0.899768 -2.500054 0.344234
C  2.268093 -0.209247 0.302146
C  2.163466 1.064803 -0.317469
C  3.546576 -0.694844 0.67223
C  -1.933572 -0.200337 -0.615777
C  3.321397 1.836158 -0.557723
C  4.706284 0.077748 0.430429
C  4.596304 1.34636 -0.184056
C  -4.14918 0.934692 -0.646055
C  -4.87439 1.267472 0.658087
H  0.417814 -0.610584 1.427412
H  0.578099 -1.368617 -1.57584
H  1.756079 -3.027986 -0.086287
H  0.309371 -3.084761 1.056712
H  -1.822796 -2.296097 -0.499007
H  1.16877 1.426395 -0.606306
H  3.630129 -1.676867 1.153651
H  3.232093 2.817813 -1.037377
H  5.690742 -0.306646 0.721632
H  -3.805104 -1.145215 -0.319416
H  5.494128 1.946493 -0.371947
H  -3.456108 1.764487 -0.88507
H  -4.883657 0.849588 -1.469493
H  -5.496752 2.170507 0.570927
H  -4.190196 1.33068 1.516227
