program: Gaussian 09
title: 000265910
version: EM64L-G09RevD.01
frameworkgroup: C1[X(C12H13N7O4)]
method: RPBEPBE
basis: SDD
operation: Freq
keyword: #p
keyword: freq=noraman
keyword: PBEPBE/SDD
title: #p freq=noraman PBEPBE/SDD
converged: YES YES NO NO
title: Mulliken charges:
elementType: O O O O N N N N N N N C C C C C C C C C C C C H H H H H H H H H H H H H
charge: -0.184808 -0.449280 -0.214708 -0.193861 -0.139553 -0.196193 -0.076637 -0.051647 -0.004759 -0.592146 0.052050 -0.022499 0.246896 0.172447 -0.387833 -0.114612 -0.421674 0.317632 -0.303828 -0.613739 -0.322387 -0.313457 0.261796 0.237322 0.283382 0.260889 0.223937 0.186575 0.251197 0.251416 0.258381 0.321232 0.325768 0.287431 0.293822 0.371450
chargesum: 0.00000
title: Mulliken charges with hydrogens summed into heavy atoms:
elementType: O O O O N N N N N N N C C C C C C C C C C C C
charge: -0.184808 -0.077830 -0.214708 -0.193861 -0.139553 -0.196193 -0.076637 -0.051647 -0.004759 0.054853 0.052050 -0.022499 0.246896 0.172447 0.132871 -0.114612 -0.160785 0.317632 0.106684 0.147254 -0.034956 -0.019636 0.261796
polarizability: 3.55629451e+02 2.72354753e+01 2.63605780e+02 3.56999291e+00 -7.75470812e+00 9.32646114e+01
1716.lowfreq: -3.4277 -0.0007 -0.0004 -0.0003 3.5994 5.1844 25.8577 35.0884 45.9354
frequency: 25.8450 35.0577 45.9309 49.1330 66.5164 84.5074 89.3408 99.3087 112.9468 151.6232 156.8480 158.0361 189.1046 208.9656 246.8999 251.2038 271.0149 274.1439 282.3124 348.0004 356.2801 367.1668 376.7834 406.1286 440.6472 456.6955 518.8431 536.0488 566.8546 576.2632 608.2563 628.4016 661.5367 667.2173 682.2543 691.9165 702.2733 721.4799 734.3507 767.4522 780.6678 786.2153 806.3121 823.6367 831.9168 860.8976 893.3650 912.3744 916.1486 924.4617 957.8950 966.0352 1016.2107 1029.7139 1070.1441 1092.1503 1102.2047 1129.1381 1140.8727 1171.1885 1185.3449 1197.5036 1209.1769 1228.2313 1240.2839 1249.2506 1258.9845 1268.3632 1280.0589 1339.0895 1340.7832 1349.6802 1353.8592 1356.2258 1374.7214 1381.0814 1412.9052 1415.6331 1434.9706 1452.5667 1457.9851 1467.4347 1470.4645 1486.5988 1503.4568 1533.1785 1550.8111 1578.2869 1651.4797 2949.0007 2995.3736 3008.6738 3068.3286 3092.0720 3102.3206 3130.0871 3225.6168 3245.9141 3262.7218 3365.3471 3381.6428 3506.0160
redmass: 7.0742 5.7516 7.2460 8.5975 3.5721 1.5155 2.4571 3.7711 5.1978 7.9388 3.8517 5.1751 4.1437 4.9925 7.2058 6.0193 4.8009 5.8655 5.9527 1.2461 2.2249 7.3497 3.5951 4.2563 6.2301 4.8563 5.9950 7.0412 5.7972 2.9222 6.5273 5.5871 9.4404 7.9508 9.0054 6.2778 1.1722 5.3854 12.3261 4.2638 1.5966 3.4918 5.2878 1.6341 1.3923 4.9142 4.1867 1.3893 8.4094 6.6582 1.9595 2.6349 1.2419 3.4602 2.4118 2.9430 4.1327 1.3129 6.3632 2.4078 1.2266 1.8631 1.9504 2.5268 1.6243 7.6059 2.9628 1.7970 6.2898 2.4137 1.5934 2.0850 7.1921 3.1118 4.7495 7.5680 1.2717 1.9568 2.2130 1.1404 2.4620 1.0420 1.0971 1.3506 8.2735 5.7348 8.8684 8.2687 1.0801 1.0698 1.0647 1.0331 1.0950 1.0969 1.1027 1.1016 1.0970 1.0946 1.1049 1.0619 1.0456 1.1008
irintensity: 0.5856 2.9425 1.1731 0.3442 0.4748 1.7267 0.0951 11.5070 6.2043 2.4304 3.7241 0.3092 4.6441 3.7572 5.1333 5.7858 8.4325 2.8073 0.7607 4.0975 14.1886 0.6046 3.5159 5.5251 2.3900 6.1488 0.8247 5.5308 0.8431 6.9688 0.1600 0.4324 5.7379 14.3353 10.4469 12.2797 128.4595 8.1409 24.9845 72.1606 114.7161 25.3906 25.6397 0.4942 59.2831 7.2489 19.9011 0.4008 10.3518 13.6722 82.6515 32.4737 44.7137 103.8879 11.5294 8.8364 11.7888 0.9440 86.2714 38.6305 20.5145 22.4131 22.0025 31.4552 28.2283 430.8471 1.8381 27.1425 73.7546 49.0258 92.3288 2.7322 49.1083 38.9287 95.5246 136.0680 68.9141 55.2502 109.9872 10.8915 40.3975 16.4348 4.7205 21.7678 45.6415 194.8115 457.6815 9.9488 23.3007 56.9999 42.2245 45.7445 37.0948 7.2331 14.7302 3.1686 4.9160 0.0775 5.1166 114.5628 14.5281 7.2860
temp: 298.150 k
press: 1.00000 atm
elementType: 8 8 8 8 7 7 7 7 7 7 7 6 6 6 6 6 6 6 6 6 6 6 6 1 1 1 1 1 1 1 1 1 1 1 1 1
symmnumber: 1
zpe: 688969.2 jmol-1
zpe.correction: 0.262415 hartree
zpe.thermalcorrener: 0.283197 hartree
zpe.thermalcorrenthalpy: 0.284142 hartree
zpe.thermalcorrgfe: 0.210854 hartree
zpe.sumelectzpe: -1147.397662 hartree
zpe.sumelectthermal: -1147.376879 hartree
zpe.sumelectthermalent: -1147.375935 hartree
zpe.sumelectthermalfe: -1147.449223 hartree
dipole: -5.5872 -6.4756 -0.2249
dipole: 8.5558
quadrupole: -154.1325 -142.2507 -130.5007
quadrupole: -10.2194 3.7105 -3.0110
quadrupole: -11.8379 0.0440 11.7939 -10.2194 3.7105 -3.0110
hfenergy: -1147.6600769 hartree
pointgroup: C01 [X(C12H13N7O4)]
dipole: 2.5165248 2.2341408 -0.0798481 debye
polarizability: 361.1633483|14.127677|258.2977813|1.8156421|5.8829651|93.0387127 unknown
InChI: InChI=1S/C12H13N7O4/c1-17-11-7(6-14-17)12(18(13)4-5-20)16-10(15-11)8-2-3-9(23-8)19(21)22/h2-3,6,20H,4-5,13H2,1H3
charge 0 multiplicity 1
36 atoms
O  -2.567028 0.141813 -0.091152
O  2.121249 -5.101629 0.430379
O  -6.134833 0.466065 -0.097021
O  -4.80049 -1.405146 -0.208475
N  1.786511 -2.08161 -0.188796
N  2.997157 2.512426 0.084638
N  0.145947 -0.40894 -0.105381
N  0.604666 1.996308 0.049178
N  4.213482 1.825564 0.042236
N  3.146444 -2.517257 -0.157126
N  -4.979123 -0.128656 -0.126593
C  2.462654 0.313019 -0.04543
C  1.47422 -0.736234 -0.116373
C  1.920574 1.64699 0.033817
C  0.760663 -3.148167 -0.318585
C  -0.221631 0.905611 -0.024196
C  3.886995 0.505074 -0.035918
C  -1.653206 1.20808 -0.013547
C  0.951011 -4.269157 0.720062
C  2.96757 3.971169 0.172999
C  -2.345645 2.423021 0.062872
C  -3.743452 2.119795 0.032171
C  -3.831874 0.732415 -0.061101
H  0.827691 -3.587419 -1.33345
H  -0.217416 -2.652289 -0.208925
H  4.70111 -0.214526 -0.085878
H  0.079356 -4.944531 0.681507
H  1.006395 -3.829405 1.740027
H  3.4614 4.307248 1.099713
H  3.485587 4.415014 -0.692974
H  1.912867 4.286119 0.178104
H  3.654737 -2.287856 -1.023955
H  3.636501 -2.185765 0.685172
H  -1.875138 3.399979 0.131787
H  -4.584869 2.806168 0.071727
H  2.85062 -4.456791 0.196286
