program: Gaussian 09
title: 000265899
version: EM64L-G09RevD.01
frameworkgroup: C1[X(C7H9NS)]
method: RPBEPBE
basis: SDD
operation: Freq
keyword: #pfreq=noraman
keyword: PBEPBE/SDD
title: #p freq=noraman PBEPBE/SDD
converged: YES YES NO NO
title: Mulliken charges:
elementType: S N C C C C C C C H H H H H H H H H
charge: 0.146454 -0.044338 0.259561 -0.801706 -0.300239 -0.175516 -0.180859 -0.357906 -0.830525 0.264336 0.282386 0.241786 0.238901 0.232391 0.240270 0.283830 0.256802 0.244374
chargesum: 0.00000
title: Mulliken charges with hydrogens summed into heavy atoms:
elementType: S N C C C C C C C
charge: 0.146454 -0.044338 0.259561 -0.254985 -0.058453 0.063385 0.051532 -0.117636 -0.045519
polarizability: 1.24253484e+02 2.24752878e+00 9.81630403e+01 -5.43952663e+00 2.52742126e+00 6.35845877e+01
1716.lowfreq: -23.9144 -13.1220 -9.6666 -0.0013 0.0015 0.0027 11.7181 76.0780 85.0510
frequency: 10.0118 76.0441 85.0134 117.5763 199.2049 268.0341 342.6623 402.1284 472.0577 571.4301 619.7161 633.4103 664.0810 748.2473 793.3323 818.6018 861.7239 896.6224 958.2868 960.4095 971.9585 993.1907 999.5417 1039.5725 1085.2542 1149.9114 1164.7798 1229.8840 1250.3385 1294.5080 1321.5342 1342.5656 1413.0365 1428.1334 1440.5855 1454.4298 1461.2716 1561.6284 1581.1450 3007.3638 3038.8210 3118.4899 3126.0446 3127.0242 3135.1652 3137.6189 3154.4594 3171.0988
redmass: 3.4446 3.1512 1.4938 2.3941 3.7010 4.9501 1.9813 3.4252 3.9209 4.9550 6.5033 4.8870 6.7058 1.6542 2.6755 3.9125 1.6327 1.3361 1.4562 4.6316 1.1935 1.4284 1.3446 2.3530 1.6053 1.1226 1.0725 1.2612 2.7387 1.8016 3.2919 1.1324 1.9496 1.1168 1.0585 2.2569 1.0574 5.7978 5.7055 1.0283 1.0579 1.1073 1.1050 1.0882 1.1039 1.0890 1.0949 1.1016
irintensity: 3.1401 1.7619 0.5179 5.0660 2.2271 2.5942 3.0525 5.3834 2.3244 11.8282 1.4390 12.6843 6.4886 38.0668 19.7360 7.6934 0.4094 0.1753 0.7211 2.4876 7.5424 11.1710 0.1065 4.6446 7.2715 2.3446 1.9341 1.5613 1.0880 1.9500 0.1698 1.5152 14.1901 9.3989 13.2706 37.0881 17.1890 11.5404 36.2182 26.6331 18.7828 5.1740 16.6502 13.4397 9.9562 5.5684 24.9357 20.0057
temp: 298.150 k
press: 1.00000 atm
elementType: 16 7 6 6 6 6 6 6 6 1 1 1 1 1 1 1 1 1
symmnumber: 1
zpe: 375017.0 jmol-1
zpe.correction: 0.142836 hartree
zpe.thermalcorrener: 0.152143 hartree
zpe.thermalcorrenthalpy: 0.153087 hartree
zpe.thermalcorrgfe: 0.105827 hartree
zpe.sumelectzpe: -724.277733 hartree
zpe.sumelectthermal: -724.268426 hartree
zpe.sumelectthermalent: -724.267482 hartree
zpe.sumelectthermalfe: -724.314742 hartree
dipole: 2.1359 -0.2638 -0.3856
dipole: 2.1864
quadrupole: -57.1768 -57.0303 -62.6676
quadrupole: -3.4438 -3.4501 -2.1941
quadrupole: 1.7814 1.9280 -3.7094 -3.4438 -3.4501 -2.1941
hfenergy: -724.4205695 hartree
pointgroup: C01 [X(C7H9N1S1)]
dipole: -0.8319433 0.0294226 -0.2166827 debye
dipolederiv: -0.3722316 0.0267981 -0.0950624 -0.0098586 -0.0523834 -0.0279097 -0.050694 -0.0417258 -0.1783298 -0.4031289 -0.0273755 -0.0625669 -0.150238 -0.3634115 -0.0273049 -0.0695485 -0.0057061 -0.2642616 0.5779881 0.1450967 0.201617 0.0346903 0.0897325 -0.0005979 0.2718226 0.0743359 0.0018549 0.1438537 -0.0222361 -0.0740903 -0.0471876 0.020562 -0.000469 0.0039111 -0.0273745 0.1653545 -0.3566352 -0.022666 -0.0719651 0.135944 0.0505539 0.0734053 -0.1819522 -0.0322319 -0.155904 0.1430518 -0.0505626 0.1128193 0.0054227 0.153613 0.0070632 0.1550958 -0.0011926 -0.0438129 -0.0293853 0.1187417 0.0831643 -0.0825759 -0.2444409 -0.0036483 0.0382532 0.0525606 -0.0805461 0.0416281 -0.067126 0.0808135 0.1505215 0.3732604 0.0865715 0.0456301 0.0055515 -0.0148259 0.0255658 -0.1049921 0.0121851 -0.0869099 0.0910026 0.0050439 0.0476513 0.0447558 0.0542069 0.0145949 0.0441536 0.0491036 -0.0108431 -0.0039694 -0.1165653 0.0155906 -0.0642321 0.0270795 -0.0055349 -0.0024353 0.0047208 0.0254809 -0.0041545 0.1304478 0.0085911 0.0512174 0.0057691 0.112723 -0.0490977 -0.0386232 -0.037225 -0.0681951 -0.0410253 -0.0295826 -0.0415126 0.1229917 0.0052292 0.089919 -0.061613 0.1001257 0.0021514 0.0361053 -0.0606906 0.0370559 0.1171009 -0.03816 -0.0541406 -0.1129097 -0.0451356 0.0786742 -0.0337085 -0.113057 -0.0411951 0.0975087 0.0769571 -0.02971 -0.028094 -0.070153 -0.1080425 -0.0543073 -0.0428455 -0.0429943 0.1091991 0.0129271 -0.0562183 -0.084243 -0.0316235 -0.0161539 -0.0816058 -0.096787 -0.0456257 0.0589402 0.0693299 0.0549122 -0.0352441 0.1162716 -0.0783442 0.0449573 -0.0659867 0.0772604 -0.0240646 -0.018773 0.006939 0.1199882 0.0032934 0.0795456 0.0035475 0.1245986 0.0010531 0.0017396 unknown
polarizability: 121.6065505|3.1825762|97.2571967|11.6536771|8.762157|67.1373647 unknown
InChI: InChI=1S/C7H9NS/c1-9-6-7-4-2-3-5-8-7/h2-5H,6H2,1H3
charge 0 multiplicity 1
18 atoms
S  2.882938 1.21529 0.308455
N  -0.021545 -0.941112 0.467586
C  0.191808 0.38834 0.737345
C  1.458691 0.725545 1.481772
C  -0.718455 1.396586 0.320441
C  -1.883967 1.026675 -0.382043
C  -2.109739 -0.342283 -0.661341
C  -1.151346 -1.281699 -0.221156
C  3.265166 -0.477348 -0.424887
H  1.338112 1.606072 2.133547
H  1.798511 -0.137642 2.074858
H  -0.504398 2.447045 0.542859
H  -2.602314 1.787315 -0.706269
H  -3.001168 -0.674227 -1.202712
H  -1.283519 -2.35242 -0.416437
H  2.354286 -0.91592 -0.858898
H  3.669164 -1.143468 0.353351
H  4.020574 -0.308948 -1.20847
