program: Gaussian 09
title: 000265917
version: EM64L-G09RevD.01
frameworkgroup: C1[X(C15H21NO9)]
method: RPBEPBE
basis: SDD
operation: Freq
keyword: #p
keyword: freq=noraman
keyword: PBEPBE/SDD
title: #p freq=noraman PBEPBE/SDD
converged: YES YES NO NO
title: Mulliken charges:
elementType: O O O O O O O O O N C C C C C C C C C C C C C C C H H H H H H H H H H H H H H H H H H H H H
charge: -0.249038 -0.278711 -0.254077 -0.244044 -0.290171 -0.236944 -0.222443 -0.238573 -0.260773 -0.180278 -0.066282 -0.161903 -0.152529 -0.070035 -0.345410 0.266515 -0.773638 0.287674 0.310025 0.338808 0.322716 -0.757821 -0.756552 -0.761056 -0.765553 0.308292 0.296646 0.327374 0.321961 0.224837 0.261562 0.262679 0.257903 0.242568 0.253355 0.248740 0.253499 0.257375 0.252430 0.254136 0.250520 0.250575 0.254541 0.240313 0.234980 0.285804
chargesum: 0.00000
title: Mulliken charges with hydrogens summed into heavy atoms:
elementType: O O O O O O O O O N C C C C C C C C C C C C C C C
charge: -0.249038 -0.278711 -0.254077 -0.244044 -0.290171 -0.236944 -0.222443 -0.238573 -0.260773 -0.180278 0.242010 0.134743 0.174845 0.251926 0.140989 0.266515 -0.010488 0.287674 0.310025 0.338808 0.322716 -0.002226 0.007389 -0.005420 -0.004456
polarizability: 2.17015964e+02 -6.96158122e-01 1.83729622e+02 2.16208279e+00 -1.89456517e+00 1.86304341e+02
1716.lowfreq: -9.0140 0.0005 0.0008 0.0008 1.6675 5.8062 17.6318 18.0671 24.3430
frequency: 17.1534 17.6471 24.2909 31.5179 36.4963 43.6661 48.2117 49.7268 58.6046 68.5906 72.1048 75.1102 79.5574 84.7390 96.1305 107.2367 113.9868 128.1961 140.7331 171.6454 175.5790 186.9899 198.8421 231.2104 244.7261 256.8160 279.1343 286.3328 291.0044 338.4196 387.2722 390.8817 424.1593 435.1573 475.7214 498.2465 520.0273 539.3077 558.7530 559.3102 566.1227 567.9495 589.7091 597.1898 604.4731 622.1471 630.7505 651.1635 775.9437 798.8677 799.6084 816.2589 830.5968 872.2346 878.4466 933.8094 951.8452 965.6960 975.1063 980.7921 985.8834 989.0049 996.6984 1000.6086 1013.6414 1033.8716 1036.5390 1041.3026 1042.5621 1043.3811 1043.8880 1051.3575 1087.0362 1104.8017 1160.8593 1180.9293 1190.9680 1201.0264 1209.4266 1213.8391 1234.9897 1262.8563 1278.4294 1292.8313 1306.1094 1326.7735 1340.6377 1346.1150 1361.5666 1370.5701 1380.0976 1383.1003 1384.2695 1384.9726 1386.8733 1443.0301 1450.3875 1451.2302 1451.9616 1452.5090 1452.6081 1453.4186 1454.0874 1454.2231 1457.9765 1470.7683 1598.9668 1654.3839 1656.4337 1658.7819 1674.0332 3000.9533 3005.5024 3006.7861 3008.9149 3009.5658 3029.5918 3055.4577 3058.9977 3072.8344 3094.4649 3096.3880 3097.4786 3098.2551 3098.7039 3101.2872 3106.4000 3129.7521 3141.4950 3142.6142 3145.3349 3146.0087
redmass: 4.0418 1.5342 3.3767 7.1784 4.3288 1.2765 4.2222 6.5784 3.8097 2.6184 2.4505 3.9985 1.3663 2.6904 2.0010 4.2418 1.7460 1.0349 6.5223 6.0351 5.6037 6.6437 9.0945 7.4350 4.9003 6.3742 4.2532 2.9730 4.1776 5.1577 3.7060 3.4843 4.0887 3.8467 3.4349 3.8863 3.8415 3.6909 3.2876 3.2523 3.2443 3.5275 5.0743 3.6856 4.7636 5.0055 4.8068 4.6650 4.6439 5.8014 4.5400 5.5456 5.6065 6.5781 6.8917 3.2251 5.5455 3.4292 2.6213 2.6342 2.0103 2.0660 2.3658 2.5397 3.1255 1.9211 1.7995 1.6602 1.6681 1.6726 1.7010 2.2615 2.7916 1.5217 3.5544 3.2489 3.3824 3.2363 3.3686 2.7688 1.4758 1.2897 1.2439 1.2544 1.2867 1.7135 1.6257 1.6574 1.8534 1.3402 1.2805 1.2407 1.2395 1.2392 1.2477 1.0896 1.0784 1.0586 1.0591 1.0527 1.0498 1.0596 1.0528 1.0526 1.0566 1.0783 8.7255 9.5480 9.4523 9.3046 9.9286 1.0382 1.0372 1.0378 1.0368 1.0372 1.0573 1.0852 1.0862 1.0870 1.0958 1.0971 1.0874 1.0969 1.0952 1.0950 1.1072 1.1006 1.1023 1.1020 1.1011 1.1011
irintensity: 0.8901 1.3927 1.1830 0.4839 0.5207 3.1791 1.1713 0.5308 3.8534 2.6913 1.4610 3.4502 0.5918 0.2368 0.3724 11.1273 2.3147 0.5389 1.2678 2.5302 1.7594 2.3393 3.9544 3.9533 13.6554 3.6508 9.6679 5.1185 8.6688 9.1174 10.3551 12.4187 9.9252 6.1930 4.8624 12.4178 2.8894 6.2113 5.6206 2.7489 6.2004 11.3189 10.9219 17.5106 13.3810 4.3328 6.7313 10.2996 19.7200 16.1354 15.3347 69.0185 40.3045 53.6571 170.1855 18.1845 83.7774 16.6225 15.4248 58.4848 66.3779 39.1751 159.4989 100.0162 13.7313 16.6907 29.0529 3.6293 11.5845 15.3685 12.3681 30.5377 3.9581 3.2883 275.7526 372.6062 555.3798 32.6636 77.4797 19.5658 9.9307 12.2348 24.8036 27.0184 3.9908 43.6998 31.0914 111.2063 113.0652 6.8622 77.2431 12.5633 59.8665 119.4533 28.7755 18.9497 15.9693 24.6600 38.8052 17.7250 14.4751 21.2659 4.8571 32.2052 24.9810 28.2258 247.7789 169.4824 62.4805 213.8804 201.4658 3.5307 3.1077 1.2568 1.1615 0.7118 29.5941 2.8146 7.6637 10.5495 8.0856 5.1235 5.0015 4.3893 5.5816 7.8729 9.3064 7.6011 10.1365 8.3490 8.5608 7.9139
temp: 298.150 k
press: 1.00000 atm
elementType: 8 8 8 8 8 8 8 8 8 7 6 6 6 6 6 6 6 6 6 6 6 6 6 6 6 1 1 1 1 1 1 1 1 1 1 1 1 1 1 1 1 1 1 1 1 1
symmnumber: 1
zpe: 925319.6 jmol-1
zpe.correction: 0.352436 hartree
zpe.thermalcorrener: 0.381212 hartree
zpe.thermalcorrenthalpy: 0.382156 hartree
zpe.thermalcorrgfe: 0.287086 hartree
zpe.sumelectzpe: -1314.075049 hartree
zpe.sumelectthermal: -1314.046272 hartree
zpe.sumelectthermalent: -1314.045328 hartree
zpe.sumelectthermalfe: -1314.140398 hartree
dipole: 1.6448 -0.8279 -2.2070
dipole: 2.8743
quadrupole: -150.6151 -139.6670 -141.6669
quadrupole: 10.4159 -12.2320 -9.2054
quadrupole: -6.6320 4.3160 2.3161 10.4159 -12.2320 -9.2054
hfenergy: -1314.4274841 hartree
pointgroup: C01 [X(C15H21N1O9)]
dipole: -0.5480491 0.2681004 -0.9521466 debye
polarizability: 215.9426078|-6.2696678|185.6202648|0.4702067|2.0865992|185.4870548 unknown
InChI: InChI=1S/C15H21NO9/c1-7(17)16-12(6-22-8(2)18)13(23-9(3)19)14(24-10(4)20)15(16)25-11(5)21/h12-15H,6H2,1-5H3
charge 0 multiplicity 1
46 atoms
O  -0.971326 0.765452 -2.212259
O  -0.475056 1.70516 1.346853
O  -1.718168 -1.479788 -0.090644
O  3.523737 0.597927 -0.610149
O  2.343416 -2.154969 -0.938341
O  -2.317534 2.660514 -2.025181
O  -2.525929 1.549231 2.454429
O  -2.272815 -2.383607 2.000815
O  3.647975 -0.352408 1.522008
N  0.626445 -0.828505 -0.125832
C  1.055077 0.359442 -0.933065
C  -0.229252 1.207695 -1.00461
C  -1.016592 0.8404 0.272351
C  -0.64721 -0.631714 0.550411
C  2.203713 1.179089 -0.289048
C  1.328241 -2.039104 -0.189388
C  0.813676 -3.19846 0.649576
C  -2.020091 1.607989 -2.6306
C  -1.365844 2.001243 2.411953
C  -2.488247 -2.290521 0.774198
C  4.117223 -0.219937 0.370189
C  -2.675686 1.046363 -3.86894
C  -0.692468 2.913021 3.407347
C  -3.578687 -2.98685 -0.006187
C  5.337173 -0.898668 -0.195988
H  1.37624 0.024504 -1.934835
H  -0.062081 2.296217 -1.056368
H  -2.105511 0.97979 0.194929
H  -0.634166 -0.882569 1.624829
H  2.232953 2.184619 -0.741669
H  2.077692 1.252797 0.804416
H  1.668933 -3.85145 0.879881
H  0.326227 -2.889515 1.587949
H  0.084418 -3.786499 0.062477
H  -3.064009 0.033842 -3.663316
H  -3.495626 1.705424 -4.187352
H  -1.935018 0.951666 -4.681763
H  0.285578 2.500386 3.706621
H  -1.336525 3.037631 4.289216
H  -0.507913 3.899563 2.946456
H  -3.200163 -3.340535 -0.978645
H  -3.977532 -3.825692 0.582648
H  -4.398745 -2.273055 -0.205179
H  5.88416 -0.230384 -0.879595
H  5.991522 -1.245951 0.617076
H  4.984896 -1.76988 -0.778369
