program: Gaussian 09
title: 000265890
version: EM64L-G09RevD.01
frameworkgroup: C1[X(C14H14O4)]
method: RPBEPBE
basis: SDD
operation: Freq
keyword: #pfreq=noraman
keyword: PBEPBE/SDD
title: #p freq=noraman PBEPBE/SDD
converged: YES YES NO NO
title: Mulliken charges:
elementType: O O O O C C C C C C C C C C C C C C H H H H H H H H H H H H H H
charge: -0.464592 -0.389030 -0.204331 -0.127900 0.345697 -0.640575 0.214448 -0.725365 -0.718266 0.003794 0.315711 -0.083916 0.292701 -0.203143 -0.369447 -0.366940 -0.220347 -0.230600 0.284015 0.161821 0.247325 0.231824 0.186834 0.185096 0.230199 0.242462 0.366375 0.288378 0.292764 0.242363 0.245124 0.367520
chargesum: 0.00000
title: Mulliken charges with hydrogens summed into heavy atoms:
elementType: O O O O C C C C C C C C C C C C C C
charge: -0.098217 -0.021510 -0.204331 -0.127900 0.345697 -0.194740 0.214448 -0.059381 -0.060508 0.003794 0.315711 -0.083916 0.292701 -0.203143 -0.081069 -0.074176 0.022016 0.014524
polarizability: 2.51150484e+02 -1.72171027e+01 1.83586541e+02 1.34648819e+01 1.01456539e+00 8.97604046e+01
1716.lowfreq: -5.5961 -4.6231 -0.0006 -0.0004 0.0002 4.2158 29.8710 43.3259 64.9954
frequency: 29.8018 43.2811 64.9906 89.4365 126.3162 150.5957 181.3039 207.9536 221.9472 245.9215 257.8591 277.0340 305.9022 343.8762 360.8362 371.5404 390.8578 392.8075 418.4506 422.5900 432.2955 461.2390 490.3246 513.4170 523.6316 567.2466 630.5769 644.5659 650.0862 674.7964 684.1550 726.1547 752.0734 789.4183 798.8439 855.6769 876.2222 887.3140 922.9953 925.2254 929.1543 954.6614 989.7159 995.0951 1010.9711 1012.7941 1039.3353 1078.2811 1121.4220 1152.0836 1156.2211 1172.4400 1182.1041 1197.9495 1222.9587 1249.6764 1281.8183 1307.5336 1314.7726 1375.4449 1385.2134 1388.4354 1396.2424 1402.5183 1438.9465 1447.5967 1462.1775 1465.8130 1470.7411 1482.7177 1485.5426 1524.4221 1569.9141 1577.1895 1600.2305 1615.2403 2943.5088 2971.8932 2984.1251 3025.0802 3066.5599 3081.4815 3093.2435 3100.5268 3141.8771 3154.9191 3169.2130 3183.7703 3309.4876 3535.0218
redmass: 4.3580 4.7317 10.1194 4.1276 4.5857 5.5046 4.8862 1.0747 2.2183 2.0232 2.3351 3.8138 4.4234 3.3466 3.7196 9.5388 2.5913 5.7403 3.3864 3.5865 3.2467 4.7175 3.6766 2.1535 1.9716 4.4431 5.2912 1.7440 2.4124 3.9488 4.7470 3.6803 4.4285 1.5101 2.7676 3.3083 2.9735 3.0788 1.5475 1.7191 3.3891 2.6222 1.4022 1.3818 1.3912 3.0752 2.1074 2.9622 1.7928 1.9884 2.3168 1.2292 1.3387 2.5689 2.5665 1.6746 1.6917 1.3997 4.4733 1.2137 2.4742 1.3993 8.8389 1.3477 2.4276 1.0641 1.1355 1.0612 1.1470 1.4097 1.6932 5.9977 8.5380 7.7802 7.5018 8.1204 1.0668 1.0387 1.0363 1.0923 1.0958 1.0994 1.0998 1.0989 1.0866 1.0913 1.0972 1.0970 1.0676 1.0646
irintensity: 0.3942 0.4349 0.9788 0.6914 1.4281 1.9984 0.7794 0.0484 1.4497 0.9777 2.2903 0.4310 4.1489 4.9689 5.3954 8.4544 2.2033 7.0337 2.8978 8.9096 22.8630 2.0516 6.8795 57.3828 24.4989 1.8214 19.7037 70.1112 18.3357 22.4756 36.2017 7.5362 5.5170 52.5583 7.0490 4.7334 22.3309 7.8493 4.7178 2.2641 34.3894 4.3558 4.2009 2.4184 0.6580 28.3358 0.7119 20.0172 1.2911 82.7499 83.6347 53.4962 47.7704 37.4393 60.8532 5.6331 14.4167 2.0200 64.5222 24.8586 66.8650 81.2042 10.6282 169.2240 11.1638 6.8414 7.5501 12.4167 40.5133 48.0954 2.9543 218.4952 8.6351 139.1784 22.3005 7.1916 36.8421 18.0369 31.3063 3.2782 23.0656 36.3076 21.0800 36.9228 3.3151 4.5322 16.0458 7.4561 263.7699 46.3150
temp: 298.150 k
press: 1.00000 atm
elementType: 8 8 8 8 6 6 6 6 6 6 6 6 6 6 6 6 6 6 1 1 1 1 1 1 1 1 1 1 1 1 1 1
symmnumber: 1
zpe: 651532.0 jmol-1
zpe.correction: 0.248155 hartree
zpe.thermalcorrener: 0.264599 hartree
zpe.thermalcorrenthalpy: 0.265543 hartree
zpe.thermalcorrgfe: 0.204289 hartree
zpe.sumelectzpe: -841.470788 hartree
zpe.sumelectthermal: -841.454344 hartree
zpe.sumelectthermalent: -841.453400 hartree
zpe.sumelectthermalfe: -841.514655 hartree
dipole: 3.8082 -6.7732 -0.5928
dipole: 7.7929
quadrupole: -98.8455 -115.1271 -105.5191
quadrupole: 6.6914 5.1620 1.2908
quadrupole: 7.6517 -8.6298 0.9782 6.6914 5.1620 1.2908
hfenergy: -841.7189433 hartree
pointgroup: C01 [X(C14H14O4)]
dipole: -1.4031579 -2.5679683 0.9148208 debye
polarizability: 250.2210668|21.6874048|178.6234785|6.2250574|-23.5631346|95.6528845 unknown
InChI: InChI=1S/C14H14O4/c1-14(2,18)7-10-11(15)8-5-3-4-6-9(8)12(16)13(10)17/h3-6,15,18H,7H2,1-2H3
charge 0 multiplicity 1
32 atoms
O  3.808639 1.067932 -0.71851
O  0.227006 -2.270402 1.028589
O  1.307576 2.212688 -0.391073
O  -1.418966 2.738468 -0.676409
C  3.395124 -0.280036 -0.302493
C  2.32887 -0.175289 0.856767
C  0.873906 0.012241 0.458103
C  4.678752 -0.931138 0.251196
C  2.856998 -1.066636 -1.519954
C  -0.08314 -0.991513 0.58473
C  -1.51364 -0.82471 0.272475
C  0.463036 1.301328 -0.093978
C  -1.989459 0.445049 -0.170832
C  -1.041871 1.582871 -0.341199
C  -2.426427 -1.896603 0.424074
C  -3.363377 0.626913 -0.452685
C  -3.796638 -1.705204 0.137717
C  -4.268688 -0.444814 -0.300255
H  2.639821 0.68435 1.481903
H  2.445218 -1.068662 1.507745
H  5.482046 -0.833258 -0.498334
H  5.009842 -0.41381 1.169062
H  4.530257 -2.00462 0.472387
H  2.552568 -2.097245 -1.249262
H  1.989118 -0.556342 -1.974185
H  3.648348 -1.129803 -2.286251
H  3.005895 1.670666 -0.698979
H  -2.057454 -2.866431 0.766548
H  -3.695942 1.61397 -0.789992
H  -4.49604 -2.539309 0.256976
H  -5.331373 -0.302301 -0.521077
H  1.194994 -2.352649 1.229893
