program: Gaussian 09
title: 000265881
version: EM64L-G09RevD.01
frameworkgroup: C1[X(C5H4BrClN2S)]
method: RPBEPBE
basis: SDD
operation: Freq
keyword: #p
keyword: freq=noraman
keyword: PBEPBE/SDD
title: #p freq=noraman PBEPBE/SDD
converged: NO NO NO NO
title: Mulliken charges:
elementType: Br Cl S N N C C C C C H H H H
charge: 0.080854 0.036778 0.312574 0.109940 0.048466 -0.382873 -0.069451 -0.169772 -0.230141 -0.828007 0.274508 0.283883 0.283842 0.249399
chargesum: 0.00000
title: Mulliken charges with hydrogens summed into heavy atoms:
elementType: Br Cl S N N C C C C C
charge: 0.080854 0.036778 0.312574 0.109940 0.048466 -0.382873 -0.069451 -0.169772 0.044367 -0.010883
polarizability: 1.92423220e+02 1.91436000e+00 1.10225324e+02 4.30320944e-03 2.34058734e-02 4.27918943e+01
1716.lowfreq: -3.8434 -0.0020 -0.0018 0.0016 6.8593 7.7959 48.6354 96.2002 132.7927
frequency: 48.5959 96.1809 132.7912 142.0270 150.0094 167.5127 220.7416 279.4892 307.8791 377.3486 423.2535 434.2628 508.3898 606.7700 650.2231 676.5556 757.8193 773.2325 922.0948 946.7966 985.9058 1001.0696 1153.0012 1172.4796 1220.6781 1260.1304 1354.7367 1364.3584 1439.0446 1440.1032 1454.1227 1502.7608 3017.2400 3138.3275 3146.2228 3164.7294
redmass: 5.3120 5.1271 5.1382 1.1548 17.6543 5.6987 10.4845 11.0008 7.4799 15.9733 8.2656 3.8387 12.7019 11.2569 8.8343 7.8323 9.3783 10.9654 1.4301 11.9364 1.1818 1.2745 6.0562 3.7664 8.2828 11.0050 1.4534 1.3527 5.9704 1.0514 1.0964 7.5712 1.0291 1.1036 1.1052 1.0936
irintensity: 1.7372 1.4764 1.9888 0.2609 0.0921 0.1342 1.2658 0.7266 0.9803 0.6002 12.2094 3.6880 28.4450 0.4555 14.2228 9.2098 4.6510 48.2122 9.0768 24.5831 7.7218 3.6663 21.5260 190.4636 132.4248 2.8505 200.0947 131.4665 154.0375 16.0727 36.3642 128.1336 16.7627 8.7852 9.3940 4.6023
temp: 298.150 k
press: 1.00000 atm
elementType: 35 17 16 7 7 6 6 6 6 6 1 1 1 1
symmnumber: 1
zpe: 217941.0 jmol-1
zpe.correction: 0.083009 hartree
zpe.thermalcorrener: 0.093380 hartree
zpe.thermalcorrenthalpy: 0.094324 hartree
zpe.thermalcorrgfe: 0.044817 hartree
zpe.sumelectzpe: -1173.263257 hartree
zpe.sumelectthermal: -1173.252886 hartree
zpe.sumelectthermalent: -1173.251942 hartree
zpe.sumelectthermalfe: -1173.301449 hartree
dipole: -0.4402 0.5568 0.0084
dipole: 0.7098
quadrupole: -73.8262 -84.1593 -82.2182
quadrupole: -9.3832 -0.0282 0.0089
quadrupole: 6.2417 -4.0914 -2.1503 -9.3832 -0.0282 0.0089
hfenergy: -1173.3462664 hartree
pointgroup: C01 [X(C5H4Br1Cl1N2S1)]
dipole: 0.1751902 -0.2164799 -0.0209333 debye
dipolederiv: -0.7694304 0.0306744 0.0458042 0.0197058 0.0212661 -0.002058 0.0454294 -0.0026432 0.0326888 -0.2148464 -0.2639721 -0.0093801 -0.3931475 -0.7404581 -0.0264959 -0.0180844 -0.0330426 -0.0511282 -0.8021385 0.1274086 0.0492635 -0.0424154 0.106328 0.0116173 0.0387556 0.003049 -0.0413697 -1.3609579 -0.3695881 0.0425299 -0.5207645 -0.5869163 -0.0061033 0.0324164 -0.0139644 -0.0989637 -1.1623821 -0.0661363 0.0487294 0.3917291 -0.4319384 -0.0392003 0.0800184 -0.0146826 -0.1711793 2.0458864 0.0115125 -0.1082836 0.1385291 0.2709772 0.0116884 -0.100002 0.018106 0.0119048 1.0334068 -0.1140213 -0.0679912 -0.1766022 -0.719156 -0.0356721 -0.0726732 -0.0387565 -0.0649375 0.6540617 0.4810646 0.0023639 0.424095 1.3999557 0.0681576 -0.0011747 0.064566 0.0873344 0.3898368 0.2580482 -0.002068 0.0795419 0.4995363 0.0289342 -0.0143257 0.019145 0.0204382 0.0966534 -0.1221503 -0.0106086 -0.1075636 0.1124749 0.0105424 -0.010515 0.0113003 0.0454107 0.0260465 0.0558496 0.0093186 0.0739637 0.0270076 -0.0109446 0.010633 -0.0100236 0.1264514 0.0883684 -0.0236814 -0.0745546 0.0520379 -0.0139332 -0.0722119 -0.0548339 -0.0523425 -0.0165433 0.1002126 -0.0273302 0.0604418 0.052017 -0.0298353 0.0655227 0.0509291 0.0537504 -0.0125586 -0.1247171 0.0223218 0.0144348 0.0088739 0.0846914 -0.0037764 0.013427 -0.0044611 0.132452 unknown
polarizability: 191.9499849|3.2323108|109.9782134|-7.7997654|4.4106189|43.5122403 unknown
InChI: InChI=1S/C5H4BrClN2S/c1-10-5-8-2-3(6)4(7)9-5/h2H,1H3
charge 0 multiplicity 1
14 atoms
Br -3.554417 0.301654 0.104316
Cl -1.506551 -2.448466 -0.197165
S  2.898654 0.713982 -0.216918
N  0.544184 -0.703311 -0.18815
N  0.408251 1.717723 -0.01372
C  1.103172 0.540873 -0.132596
C  -1.614082 0.35743 0.001965
C  -0.796446 -0.791539 -0.121799
C  -0.942222 1.607968 0.051906
C  3.40599 -1.083869 -0.360536
H  -1.513016 2.536334 0.147077
H  2.977837 -1.529722 -1.27002
H  3.066562 -1.647094 0.520862
H  4.506885 -1.075462 -0.414623
