program: Gaussian 09
title: 000265888
version: EM64L-G09RevD.01
frameworkgroup: C1[X(C15H14N2O4)]
method: RPBEPBE
basis: SDD
operation: Freq
keyword: #p
keyword: freq=noraman
keyword: PBEPBE/SDD
title: #p freq=noraman PBEPBE/SDD
converged: YES YES NO NO
title: Mulliken charges:
elementType: O O O O N N C C C C C C C C C C C C C C C H H H H H H H H H H H H H H
charge: -0.272061 -0.190792 -0.261054 -0.254558 -0.434161 0.026590 0.417746 0.345070 0.215837 -0.416223 -0.537610 0.430557 -0.342148 -0.314753 -0.380260 -0.422229 -0.217574 -0.222152 -0.237433 0.216073 -0.786055 0.226111 0.225276 0.308249 0.321773 0.261690 0.360540 0.259094 0.229321 0.229638 0.229334 0.231507 0.245323 0.264306 0.245031
chargesum: 0.00000
title: Mulliken charges with hydrogens summed into heavy atoms:
elementType: O O O O N N C C C C C C C C C C C C C C C
charge: -0.272061 -0.190792 -0.261054 -0.254558 -0.073622 0.026590 0.417746 0.345070 0.215837 0.035165 -0.229362 0.430557 -0.080458 0.007020 -0.121167 -0.192909 0.012063 0.007182 -0.005926 0.216073 -0.031395
polarizability: 3.21160894e+02 -1.10426576e+01 2.20506310e+02 6.06254450e+00 9.51829170e+00 9.09048324e+01
1716.lowfreq: -57.1474 -6.1600 -2.5459 -0.0009 0.0001 0.0007 3.8295 8.2925 23.6596
frequency: -57.1438 5.3440 23.6283 47.6063 51.1375 71.7709 85.0137 100.1107 121.5810 158.3005 172.1374 199.3454 201.8649 237.6963 275.5848 317.9610 345.7632 372.8609 400.6859 409.3438 429.3466 434.2349 478.4395 504.1676 532.6697 553.1040 587.4157 602.8969 617.2497 653.4022 669.2840 678.0713 701.8534 718.1210 741.2055 752.1418 813.1819 824.3607 845.5930 855.0574 878.9510 881.4995 905.6183 914.7500 934.6671 979.2521 985.4353 987.3478 989.9237 991.2756 997.6360 1012.5817 1028.0541 1035.0990 1054.2580 1087.0519 1147.3381 1163.9012 1173.6326 1187.9567 1204.9060 1207.4546 1227.7861 1232.9073 1253.6433 1303.6472 1316.4126 1342.9057 1353.6481 1364.5397 1380.6468 1390.4535 1432.4169 1441.5855 1448.8175 1464.5686 1469.0148 1486.3072 1495.2903 1511.9156 1574.6215 1596.7762 1618.7127 1628.1990 1633.5874 2940.1071 2992.8297 3004.1391 3077.7514 3115.0598 3130.1080 3138.9188 3143.5407 3159.2613 3164.9650 3170.8037 3188.6151 3193.5852 3281.8640
redmass: 1.0474 3.9658 5.2413 5.7673 11.2475 3.7325 4.0012 7.8991 5.6706 5.2389 5.2788 5.2867 6.4445 3.7985 6.4313 5.2512 6.2778 5.6270 2.8450 6.4661 4.1127 4.7209 3.5015 5.2965 5.7524 3.4970 2.9904 5.5812 6.3116 6.0523 7.5101 5.6552 2.1526 6.1338 1.8998 3.9737 4.9846 3.9465 1.4567 1.2509 1.1117 6.1622 1.4436 1.3500 5.8817 1.3950 2.5805 1.3379 4.4998 2.9951 1.3445 1.7152 2.1518 1.6718 2.5650 1.5693 1.9227 3.4971 1.0539 1.1125 1.3500 1.7938 1.8376 3.9854 2.1148 2.3154 1.3768 5.6333 2.5555 2.4104 1.2477 4.0586 4.8320 2.1528 1.1503 1.0462 1.1702 2.3742 2.7695 2.6097 3.9448 6.1794 6.0666 4.2180 6.9832 1.0576 1.0382 1.1033 1.0979 1.0880 1.0867 1.0988 1.0925 1.0963 1.0896 1.0995 1.0951 1.0919 1.0796
irintensity: 0.5780 0.4295 0.0423 0.0986 4.4042 1.7452 0.7049 7.9427 6.2883 0.5716 5.2418 2.5831 2.3602 3.8078 0.5908 0.5588 2.3727 0.5338 1.2279 2.0361 0.6131 2.4078 13.5613 9.1678 4.1896 19.0394 0.4218 6.2057 0.7306 0.3524 7.1497 0.6995 34.4508 2.4696 56.1650 40.1800 4.7281 5.9876 50.5137 0.2663 84.0298 10.6584 21.8465 5.1299 9.8055 1.0391 58.3638 6.8712 37.9456 148.4975 0.2849 7.5873 5.7482 11.3483 4.0482 9.0046 103.9028 147.8897 0.5052 10.9086 8.4387 177.8545 14.3602 289.5448 287.4619 44.3208 15.4876 343.6753 135.7603 3.6282 68.0633 8.5113 2.3878 17.0096 33.9735 19.4586 118.8690 0.0550 133.8375 564.6211 214.2394 1.2909 4.2289 73.9998 4.9381 26.8894 3.6195 27.0290 10.6552 9.6140 0.3877 9.3335 24.2410 33.4000 8.2949 11.0497 17.6537 8.5014 99.2909
temp: 298.150 k
press: 1.00000 atm
elementType: 8 8 8 8 7 7 6 6 6 6 6 6 6 6 6 6 6 6 6 6 6 1 1 1 1 1 1 1 1 1 1 1 1 1 1
symmnumber: 1
zpe: 693882.4 jmol-1
zpe.correction: 0.264286 hartree
zpe.thermalcorrener: 0.282499 hartree
zpe.thermalcorrenthalpy: 0.283443 hartree
zpe.thermalcorrgfe: 0.213935 hartree
zpe.sumelectzpe: -988.823114 hartree
zpe.sumelectthermal: -988.804900 hartree
zpe.sumelectthermalent: -988.803956 hartree
zpe.sumelectthermalfe: -988.873465 hartree
dipole: -2.2403 -2.5965 0.2893
dipole: 3.4416
quadrupole: -101.3279 -136.7967 -123.5527
quadrupole: 1.8313 0.3772 5.0723
quadrupole: 19.2313 -16.2376 -2.9936 1.8313 0.3772 5.0723
hfenergy: -989.0873996 hartree
pointgroup: C01 [X(C15H14N2O4)]
dipole: 0.8931677 -0.9926986 0.2239612 debye
polarizability: 320.4059543|15.5113755|203.5446743|8.5587313|-44.7933964|108.6214072 unknown
InChI: InChI=1S/C15H14N2O4/c1-11(18)16-14-8-7-13(9-15(14)17(19)20)21-10-12-5-3-2-4-6-12/h2-9,16H,10H2,1H3
charge 0 multiplicity 1
35 atoms
O  1.596263 0.218196 0.024724
O  -2.092281 3.264479 -0.919538
O  -4.05197 2.135502 -0.717945
O  -4.366352 -2.682898 0.457337
N  -4.044059 -0.411638 -0.087831
N  -2.740227 2.180234 -0.673224
C  0.218382 -0.017631 0.012503
C  -2.643681 -0.296651 -0.051215
C  -1.992935 0.959538 -0.333786
C  2.484236 -0.927163 0.307657
C  -0.586372 1.090405 -0.30026
C  3.922575 -0.462465 0.19494
C  -0.399915 -1.26758 0.296351
C  -1.796772 -1.397992 0.262903
C  4.297412 0.550847 -0.720666
C  4.918235 -1.087324 0.985548
C  5.652826 0.928944 -0.845019
C  6.275108 -0.716112 0.853025
C  6.646349 0.294302 -0.063519
C  -4.834039 -1.54672 0.155125
C  -6.32855 -1.276023 0.017831
H  2.271132 -1.730412 -0.43052
H  2.278574 -1.320913 1.323654
H  -0.132192 2.059297 -0.517562
H  -2.271693 -2.356358 0.4799
H  0.197632 -2.148184 0.548365
H  -4.513898 0.479968 -0.329669
H  3.524361 1.047825 -1.314534
H  4.636799 -1.86332 1.708843
H  5.933436 1.718807 -1.550679
H  7.036912 -1.20628 1.469252
H  7.6971 0.588279 -0.162862
H  -6.660371 -0.502179 0.734173
H  -6.876753 -2.207608 0.217359
H  -6.577669 -0.921772 -0.999263
