program: Gaussian 09
title: 000265887
version: EM64L-G09RevD.01
frameworkgroup: C1[X(C15H10Cl2O3)]
method: RPBEPBE
basis: SDD
operation: Freq
keyword: #p
keyword: freq=noraman
keyword: PBEPBE/SDD
title: #p freq=noraman PBEPBE/SDD
converged: YES YES NO NO
title: Mulliken charges:
elementType: Cl Cl O O O C C C C C C C C C C C C C C C H H H H H H H H H H
charge: -0.048001 -0.058930 -0.238733 -0.414634 -0.197604 0.031821 -0.207315 0.587962 0.517118 0.171757 -0.344396 -0.344661 -0.365679 -0.324528 -0.236947 -0.231344 -0.244029 -0.237782 -0.226495 -0.222996 0.263596 0.248646 0.275379 0.256916 0.258268 0.234712 0.237635 0.236497 0.238044 0.385722
chargesum: 0.00000
title: Mulliken charges with hydrogens summed into heavy atoms:
elementType: Cl Cl O O O C C C C C C C C C C C C C C C
charge: -0.048001 -0.058930 -0.238733 -0.028913 -0.197604 0.031821 0.056281 0.587962 0.517118 0.171757 -0.344396 -0.344661 -0.117033 -0.049149 0.019969 0.026924 -0.009317 -0.000146 0.010002 0.015049
polarizability: 2.02885179e+02 -1.08592317e+01 1.86301631e+02 -1.82904695e+01 2.73099541e+01 1.52259642e+02
1716.lowfreq: -6.1859 -4.0464 0.0003 0.0013 0.0015 5.0206 9.2791 35.7773 51.0346
frequency: 7.3015 35.7738 51.0266 52.9510 69.5982 98.8423 124.1475 140.6182 157.6111 159.4835 193.6791 243.1806 264.3627 290.1764 299.5178 328.1857 384.9637 391.4145 427.9183 431.3096 449.0972 462.0213 506.3854 545.7104 557.6290 598.2210 601.3244 628.2072 643.0049 671.6810 700.1271 720.0184 726.6675 735.4302 760.5724 765.0055 813.3686 860.1523 866.8378 878.2843 888.6993 924.2323 955.6979 956.2500 989.1480 991.3315 1017.5593 1019.4029 1031.2903 1039.3406 1043.5051 1076.7721 1120.4188 1130.4244 1146.3287 1174.0403 1176.0862 1231.9377 1254.6509 1261.2304 1282.9767 1301.7414 1363.8322 1368.9087 1383.0388 1418.7541 1422.3718 1460.1917 1467.9253 1569.7663 1574.5880 1604.2206 1606.3034 1674.2935 3134.4047 3139.2842 3141.2949 3153.0449 3158.1487 3166.4678 3174.0466 3177.6471 3183.3405 3519.0975
redmass: 9.3440 8.8950 5.5409 9.9912 8.7198 7.5404 6.0241 9.4547 6.7905 6.0555 7.8456 6.3927 6.1832 7.5876 6.1202 6.4911 6.1370 10.5392 6.7237 7.8136 3.5566 3.7538 4.3654 3.1017 4.3044 3.5081 3.0929 2.5184 6.1277 5.3837 6.6775 4.4031 5.9937 3.7894 1.2315 1.3263 6.3098 2.2257 1.4679 3.1080 3.7146 4.8912 1.4253 1.3996 1.3421 1.3441 7.0180 5.0243 3.0235 2.2277 1.9495 1.4254 1.8350 1.6493 2.1137 1.0604 1.0616 1.6239 1.6312 1.5131 2.1996 2.6500 6.7539 9.2425 2.5465 2.2140 2.2335 2.5132 2.6478 6.1953 6.2518 7.1131 7.0531 9.3026 1.0896 1.0858 1.0864 1.0905 1.0917 1.0952 1.0959 1.1000 1.0979 1.0642
irintensity: 0.4668 1.3255 1.4449 0.3842 1.3518 1.3583 0.4607 0.1334 0.1379 0.1062 0.5506 0.7387 0.6921 0.5246 3.8422 1.0037 3.3097 14.1386 6.1805 1.5015 11.1186 11.3124 0.9108 5.7554 0.3547 53.2823 88.7933 67.7336 0.8041 54.7922 0.0155 2.3249 14.8252 8.4397 55.9944 99.1654 9.8733 8.6858 1.5598 12.1210 6.8192 12.3918 3.1268 0.8263 0.5113 0.6533 17.7363 28.8459 219.5824 105.4271 37.5243 5.4194 3.2626 2.1899 2.7988 1.1297 0.6207 6.6275 5.9405 1.9029 12.9759 28.5623 3.3492 3.8049 85.0204 2.3515 51.1864 8.4997 28.8900 2.2267 13.0921 3.8078 7.8326 199.9063 5.4252 1.4314 2.9557 9.9832 12.0400 8.7090 6.1371 12.6419 8.3541 42.4507
temp: 298.150 k
press: 1.00000 atm
elementType: 17 17 8 8 8 6 6 6 6 6 6 6 6 6 6 6 6 6 6 6 1 1 1 1 1 1 1 1 1 1
symmnumber: 1
zpe: 547386.3 jmol-1
zpe.correction: 0.208488 hartree
zpe.thermalcorrener: 0.226284 hartree
zpe.thermalcorrenthalpy: 0.227228 hartree
zpe.thermalcorrgfe: 0.159670 hartree
zpe.sumelectzpe: -1721.942835 hartree
zpe.sumelectthermal: -1721.925040 hartree
zpe.sumelectthermalent: -1721.924095 hartree
zpe.sumelectthermalfe: -1721.991653 hartree
dipole: 1.6586 0.7327 2.5929
dipole: 3.1640
quadrupole: -115.3434 -116.8079 -128.8719
quadrupole: -6.6077 -9.6871 -1.2857
quadrupole: 4.9976 3.5331 -8.5308 -6.6077 -9.6871 -1.2857
hfenergy: -1722.1513233 hartree
pointgroup: C01 [X(C15H10Cl2O3)]
dipole: -0.5823676 0.012122 1.1001184 debye
polarizability: 206.4121515|-2.5982764|164.6938623|21.4483644|-29.7557684|170.3404381 unknown
InChI: InChI=1S/C15H10Cl2O3/c16-11-7-3-1-5-9(11)15(13(20-15)14(18)19)10-6-2-4-8-12(10)17/h1-8,13,18H
charge 0 multiplicity 1
30 atoms
Cl 0.69076 2.357064 -2.02291
Cl -1.354396 -1.356476 2.282317
O  0.203403 -0.771853 -1.893731
O  1.461116 -3.642948 0.077784
O  2.737613 -1.941728 -0.877438
C  -0.052072 -0.345171 -0.472678
C  0.271037 -1.79529 -0.802679
C  0.991416 0.560215 0.14476
C  -1.509945 -0.017657 -0.205472
C  1.624159 -2.404914 -0.566469
C  1.384469 1.792289 -0.431145
C  -2.193178 -0.375582 0.980049
C  1.595514 0.199812 1.378124
C  -2.250586 0.679219 -1.196667
C  2.335846 2.635625 0.174627
C  -3.541704 -0.040553 1.208343
C  2.544198 1.031703 2.005542
C  -3.602202 1.024213 -0.992078
C  2.916744 2.253733 1.403458
C  -4.24816 0.672625 0.214861
H  -0.560202 -2.508744 -0.780437
H  1.304229 -0.744291 1.848294
H  -1.743634 0.932865 -2.13109
H  2.617053 3.573585 -0.312415
H  -4.028683 -0.340303 2.140568
H  2.993077 0.724383 2.955444
H  -4.148718 1.563059 -1.772652
H  3.656731 2.906975 1.877523
H  -5.296908 0.938066 0.384473
H  2.356025 -4.049419 0.236891
