program: Gaussian 09
title: 000024738
version: EM64L-G09RevD.01
frameworkgroup: C1[X(C9H14ClN5)]
method: RPBEPBE
basis: SDD
operation: Freq
keyword: #p
keyword: freq=noraman
keyword: PBEPBE/SDD
title: #p freq=noraman PBEPBE/SDD
converged: NO YES NO NO
title: Mulliken charges:
elementType: Cl N N N N N C C C C C C C C C H H H H H H H H H H H H H H
charge: -0.023173 -0.337386 -0.102148 -0.342382 -0.027242 -0.017839 -0.116165 -0.454158 -0.531935 0.092603 -0.025529 0.099527 -0.715362 -0.673406 -0.298721 0.266709 0.243063 0.242948 0.240193 0.241215 0.334598 0.239050 0.329321 0.225389 0.208288 0.234362 0.254226 0.208390 0.205567
chargesum: 0.00000
title: Mulliken charges with hydrogens summed into heavy atoms:
elementType: Cl N N N N N C C C C C C C C C
charge: -0.023173 -0.002788 -0.102148 -0.013062 -0.027242 -0.017839 0.150544 0.031853 -0.050527 0.092603 0.213520 0.099527 -0.047324 -0.005223 -0.298721
polarizability: 1.84404086e+02 6.73166949e-01 1.76375495e+02 1.95542857e+00 2.43811085e+00 8.72771207e+01
1716.lowfreq: -8.5516 -5.4805 -2.0416 0.0017 0.0021 0.0030 29.6419 41.2200 55.3962
frequency: 29.6256 41.1330 55.3807 64.5783 76.1485 129.9092 172.7368 179.5660 182.0856 212.4659 218.0127 248.8616 289.4859 313.9869 339.9399 387.0808 408.7158 444.6124 479.8441 519.1747 564.5810 576.3933 638.8195 645.5682 676.9125 703.6231 754.3312 790.4256 801.7340 821.1331 835.5902 860.9065 895.2365 922.1939 925.6210 946.3366 966.5528 1001.4143 1041.9032 1061.1950 1066.9878 1097.9368 1138.0941 1148.5545 1162.0119 1172.3227 1180.7084 1211.2762 1215.8555 1248.4294 1303.2464 1337.6254 1349.5692 1373.3961 1377.6715 1385.2913 1397.1136 1434.8564 1462.9077 1464.4438 1468.9570 1472.4015 1481.4046 1487.8850 1510.9683 1534.1875 1587.2754 2979.9358 2983.4525 3022.3754 3073.6429 3083.1372 3095.7847 3097.9108 3099.1186 3110.4929 3123.8605 3201.3905 3222.6451 3549.2389 3553.1129
redmass: 2.8531 2.6449 3.9710 5.7161 3.0643 4.3232 10.0977 7.6229 5.2505 1.0475 4.6860 1.1332 4.3200 2.8492 3.8237 3.5114 4.2192 3.2290 3.5659 3.9540 1.1914 1.1189 7.6587 7.8378 5.0120 11.1116 1.3024 11.2076 2.3299 1.5417 2.4020 4.4655 6.0868 1.3050 2.6447 1.4735 2.2081 2.1049 1.2418 1.2660 4.7845 1.2713 2.1732 2.7303 1.3917 2.4973 2.2474 3.5119 3.5717 1.7074 1.5994 1.7637 1.4734 1.9748 1.2127 2.1716 1.2376 1.0956 1.0695 1.3472 1.1090 1.5903 1.2116 1.0591 2.8467 11.0139 7.5871 1.0371 1.0363 1.0848 1.0989 1.0991 1.0999 1.0999 1.0537 1.0606 1.0908 1.1167 1.1155 1.0769 1.0770
irintensity: 0.0047 0.0127 0.0280 0.9294 0.2230 0.1491 1.3094 0.1837 4.4344 0.0333 0.8395 0.0811 10.8202 1.0331 6.5875 4.7515 2.3140 0.1593 4.6044 3.4644 152.6247 20.7154 3.2039 18.6914 8.9664 0.0793 1.0150 31.9017 36.4043 11.8610 10.8247 9.7268 44.4079 6.6081 15.1795 1.8557 10.8568 16.2196 29.9194 10.3221 1.3274 3.0246 14.7796 95.1192 1.3024 23.3705 104.1069 14.8629 31.6498 7.9606 66.8113 258.2124 38.6216 58.1738 21.8466 96.8787 37.3377 6.3217 9.1477 30.5053 34.9863 123.4038 38.3741 9.3234 72.0831 1476.9297 351.2145 23.4685 32.0392 2.8129 9.5455 56.5638 24.0622 38.5115 14.4738 5.7438 13.8664 3.3362 22.2349 83.2069 54.7628
temp: 298.150 k
press: 1.00000 atm
elementType: 17 7 7 7 7 7 6 6 6 6 6 6 6 6 6 1 1 1 1 1 1 1 1 1 1 1 1 1 1
symmnumber: 1
zpe: 607052.7 jmol-1
zpe.correction: 0.231214 hartree
zpe.thermalcorrener: 0.246736 hartree
zpe.thermalcorrenthalpy: 0.247680 hartree
zpe.thermalcorrgfe: 0.186640 hartree
zpe.sumelectzpe: -1084.026155 hartree
zpe.sumelectthermal: -1084.010634 hartree
zpe.sumelectthermalent: -1084.009690 hartree
zpe.sumelectthermalfe: -1084.070730 hartree
dipole: -5.7990 0.1645 -0.4777
dipole: 5.8210
quadrupole: -105.1471 -79.4213 -96.3438
quadrupole: -0.6907 1.0918 0.6979
quadrupole: -11.5097 14.2161 -2.7064 -0.6907 1.0918 0.6979
hfenergy: -1084.2573695 hartree
pointgroup: C01 [X(C9H14Cl1N5)]
dipole: 0.3620085 2.2510096 0.2161514 debye
polarizability: 176.8867613|2.0587775|183.8274041|3.0308396|2.6374093|87.3425362 unknown
InChI: InChI=1S/C9H14ClN5/c1-5(2)11-8-13-7(10)14-9(15-8)12-6-3-4-6/h5-6,11-12H,3-4H2,1-2H3
charge 0 multiplicity 1
29 atoms
Cl -0.808253 -4.25587 -0.288856
N  2.317904 -0.369238 0.32171
N  0.025323 0.177255 0.187839
N  -2.302789 0.532208 0.052512
N  0.81996 -2.135858 0.037976
N  -1.554333 -1.675137 -0.109646
C  2.729195 1.002659 0.507699
C  2.987124 1.900968 -0.712729
C  4.16257 1.375706 0.129466
C  1.015568 -0.765648 0.178772
C  -2.192069 2.003725 0.181424
C  -1.243088 -0.325888 0.043101
C  -3.526999 2.555636 0.717841
C  -1.787117 2.652096 -1.164133
C  -0.474348 -2.473595 -0.097984
H  2.28734 1.489268 1.383258
H  2.711364 2.955755 -0.634739
H  2.833264 1.453375 -1.698104
H  4.791729 0.599865 -0.319133
H  4.698846 2.069853 0.781293
H  3.005144 -1.124628 0.355374
H  -1.385938 2.19735 0.912923
H  -3.220519 0.100548 -0.076971
H  -3.457102 3.648462 0.854178
H  -4.352498 2.360841 0.006154
H  -3.786829 2.101647 1.690563
H  -0.828113 2.233694 -1.513471
H  -1.666788 3.74428 -1.041893
H  -2.558048 2.471871 -1.935622
