program: Gaussian 09
title: 000265896
version: EM64L-G09RevD.01
frameworkgroup: C1[X(C17H18O4)]
method: RPBEPBE
basis: SDD
operation: Freq
keyword: #pfreq=noraman
keyword: PBEPBE/SDD
title: #p freq=noraman PBEPBE/SDD
converged: YES YES NO NO
title: Mulliken charges:
elementType: O O O O C C C C C C C C C C C C C C C C C H H H H H H H H H H H H H H H H H H
charge: -0.285869 -0.180065 -0.181834 -0.186153 0.310434 -0.569172 0.270000 -0.721395 -0.721639 -0.697245 0.075752 -0.173870 0.271737 0.327850 -0.105953 -0.377940 -0.366190 -0.225641 -0.229659 0.267079 -0.746348 0.248376 0.224543 0.208352 0.207057 0.241859 0.211090 0.218559 0.216087 0.206749 0.224380 0.205161 0.291396 0.289654 0.242136 0.242502 0.270285 0.250052 0.247883
chargesum: 0.00000
title: Mulliken charges with hydrogens summed into heavy atoms:
elementType: O O O O C C C C C C C C C C C C C C C C C
charge: -0.285869 -0.180065 -0.181834 -0.186153 0.310434 -0.096253 0.270000 -0.064128 -0.075903 -0.060954 0.075752 -0.173870 0.271737 0.327850 -0.105953 -0.086544 -0.076536 0.016495 0.012843 0.267079 0.021871
polarizability: 2.55544170e+02 -4.81042041e+00 2.34356058e+02 8.04766102e+00 2.09792058e+01 1.26310021e+02
1716.lowfreq: -9.2733 -1.6614 -0.0009 -0.0006 -0.0006 8.4435 32.4849 43.2046 45.9405
frequency: 32.3679 43.1670 45.7991 54.6672 65.8373 81.0344 114.7890 123.8543 129.6304 164.3902 185.3417 211.3465 217.5364 244.1638 251.2540 268.4208 286.2771 294.6579 319.6859 340.4557 350.2571 371.4781 373.2515 404.2178 408.3361 427.6929 440.2016 443.8702 474.4520 495.9953 529.5187 552.4161 611.0438 636.1458 661.7436 687.9479 696.1879 725.6319 746.8087 764.8942 807.1606 818.4767 842.3920 886.2661 911.7571 923.8609 929.5381 931.2352 941.7748 942.0098 979.7134 995.9489 1003.9007 1014.1125 1024.9035 1032.4390 1036.6714 1050.1329 1086.9930 1132.6495 1143.4619 1173.3211 1178.2333 1198.9093 1207.7135 1222.8625 1259.4445 1288.9655 1295.8305 1313.3622 1326.2036 1374.7178 1380.1522 1381.0377 1400.7466 1404.7421 1439.4077 1445.3905 1449.4872 1452.5565 1456.3383 1462.7879 1464.3104 1471.2885 1480.7401 1483.6770 1492.1344 1534.0908 1549.3560 1585.3207 1606.9203 1616.3113 1702.8549 2966.1018 2971.0470 2976.6986 2999.1210 3008.8172 3059.3878 3063.0947 3064.5987 3068.6200 3072.2475 3078.9085 3084.1879 3100.3759 3139.0390 3143.6062 3153.3865 3163.9465 3173.5707
redmass: 2.8664 5.0344 4.5805 5.1418 4.4024 4.2806 1.1152 6.1905 4.8818 7.4680 6.3614 1.2608 1.7236 2.5803 4.7439 1.2048 1.2859 2.2488 5.2505 6.5055 2.6156 2.7227 7.1435 3.3866 2.1642 3.8986 3.9103 4.2485 4.9021 5.5192 3.4372 5.1868 5.5369 6.2358 5.7613 5.6873 4.8261 3.6591 2.8116 5.5600 1.9410 3.3410 3.8393 2.5406 2.9431 1.8705 1.6595 1.6102 1.3166 2.6218 2.2945 1.3970 2.5891 1.3627 1.5182 1.9628 1.6940 1.8508 2.3298 2.9428 2.6534 1.1042 2.4198 2.0637 2.3682 2.5701 1.9260 2.3474 3.9726 1.5090 2.2587 1.2068 1.2079 1.2340 9.9704 1.2129 1.8135 1.3625 1.0563 1.0502 1.0514 1.0526 1.0770 2.5327 1.0689 1.0616 1.0596 8.6506 10.3702 8.1959 6.6990 9.2421 10.7757 1.0350 1.0354 1.0361 1.0574 1.0371 1.1001 1.0998 1.1020 1.1008 1.0991 1.0989 1.0992 1.0960 1.0864 1.1020 1.0903 1.0947 1.1004
irintensity: 0.3203 6.3614 1.0250 1.3679 1.1978 1.2666 0.4747 0.8374 1.1836 0.8951 0.7087 0.0389 0.1683 0.3505 0.3425 0.1397 0.5373 1.7898 1.6207 2.2600 0.8596 0.4454 16.1969 0.0301 1.1525 1.4547 9.9633 1.6073 1.0838 1.5754 18.0773 9.7709 16.9833 21.3694 2.2144 3.5507 3.0126 65.8482 23.8568 55.7111 28.8802 29.0614 7.6367 8.0423 5.1127 21.3122 4.3560 1.5882 14.3417 94.1231 150.3760 3.1908 29.4893 0.1138 0.6787 8.1495 8.9228 37.3414 2.9275 638.5198 8.6014 5.1878 4.6739 24.3740 3.3839 108.1183 16.5715 42.1986 196.1417 20.9269 43.8445 20.2995 4.0207 90.9677 0.2494 9.8067 1.2110 5.3749 20.6272 21.2002 0.8750 2.7237 8.0108 1.7822 23.0564 10.5890 25.7429 35.0879 220.7790 55.4786 1.2090 61.1010 176.8049 41.7375 23.3548 24.6446 16.1477 0.4631 24.3972 16.2008 2.0298 14.0565 91.7520 53.7816 32.6747 5.4974 3.6222 10.5351 5.0356 1.3668 25.4645
temp: 298.150 k
press: 1.00000 atm
elementType: 8 8 8 8 6 6 6 6 6 6 6 6 6 6 6 6 6 6 6 6 6 1 1 1 1 1 1 1 1 1 1 1 1 1 1 1 1 1 1
symmnumber: 1
zpe: 808066.3 jmol-1
zpe.correction: 0.307776 hartree
zpe.thermalcorrener: 0.328447 hartree
zpe.thermalcorrenthalpy: 0.329391 hartree
zpe.thermalcorrgfe: 0.258186 hartree
zpe.sumelectzpe: -957.981679 hartree
zpe.sumelectthermal: -957.961009 hartree
zpe.sumelectthermalent: -957.960064 hartree
zpe.sumelectthermalfe: -958.031270 hartree
dipole: 0.1125 -0.4671 1.7817
dipole: 1.8453
quadrupole: -97.8281 -127.4034 -130.3873
quadrupole: -9.4560 1.6480 1.7807
quadrupole: 20.7115 -8.8638 -11.8477 -9.4560 1.6480 1.7807
hfenergy: -958.2894553 hartree
pointgroup: C01 [X(C17H18O4)]
dipole: -0.0785679 -0.1713349 -0.7011136 debye
polarizability: 256.4451913|2.3437925|234.1827581|2.7501776|-20.4100751|125.5822993 unknown
InChI: InChI=1S/C17H18O4/c1-10(18)21-16-13(9-17(2,3)4)14(19)11-7-5-6-8-12(11)15(16)20/h5-8H,9H2,1-4H3
charge 0 multiplicity 1
39 atoms
O  1.648051 1.551074 -0.129446
O  -0.506999 -2.563089 1.151258
O  -0.817782 2.546145 -0.804533
O  1.030932 3.046702 1.577178
C  2.721829 -1.93494 -0.400931
C  1.984152 -1.203103 0.790685
C  0.653574 -0.571695 0.462457
C  1.807997 -3.003295 -1.054057
C  3.968142 -2.630218 0.210316
C  3.177603 -0.915833 -1.476673
C  0.512255 0.738655 0.0617
C  -0.586835 -1.392781 0.656695
C  -1.916404 -0.798562 0.307918
C  -2.014771 0.538214 -0.168182
C  -0.78983 1.369218 -0.327327
C  -3.088674 -1.5764 0.457545
C  -3.279583 1.086528 -0.487933
C  -4.348151 -1.027326 0.135844
C  -4.444269 0.3052 -0.337186
C  1.700333 2.82325 0.560021
C  2.694537 3.717013 -0.130107
H  1.809871 -1.956403 1.580494
H  2.669145 -0.428291 1.181316
H  2.379241 -3.584092 -1.802712
H  0.951218 -2.53807 -1.576805
H  1.402921 -3.702742 -0.301556
H  4.626371 -1.899629 0.717707
H  3.673013 -3.397536 0.950364
H  4.55998 -3.128567 -0.57986
H  3.846394 -0.149023 -1.044201
H  2.319146 -0.390502 -1.931505
H  3.725055 -1.43807 -2.284174
H  -2.988932 -2.601702 0.827013
H  -3.32456 2.119369 -0.847238
H  -5.253657 -1.631996 0.252671
H  -5.423446 0.728699 -0.584011
H  2.225053 4.125108 -1.043303
H  3.584121 3.145163 -0.440505
H  2.979457 4.547325 0.532064
