program: Gaussian 09
title: 000265907
version: EM64L-G09RevD.01
frameworkgroup: C1[X(C26H20BrOP)]
method: RPBEPBE
basis: SDD
operation: Freq
keyword: #p
keyword: freq=noraman
keyword: PBEPBE/SDD
title: #p freq=noraman PBEPBE/SDD
converged: YES YES NO NO
title: Mulliken charges:
elementType: Br P O C C C C C C C C C C C C C C C C C C C C C C C C C C H H H H H H H H H H H H H H H H H H H H
charge: -0.012746 0.744672 -0.281519 -0.072352 -0.044437 -0.038021 -0.630643 -0.259344 -0.317014 -0.282380 -0.287152 -0.315622 -0.254780 0.077446 -0.235440 -0.228960 -0.229291 -0.240406 -0.237714 -0.238934 0.329895 -0.220037 -0.224541 -0.232467 -0.361166 -0.386842 -0.195024 -0.214517 -0.210879 0.254930 0.261094 0.295929 0.259221 0.290637 0.278362 0.273236 0.235544 0.240274 0.234781 0.239925 0.238098 0.241508 0.237118 0.237308 0.236446 0.269067 0.276698 0.247899 0.252140
chargesum: 0.00000
title: Mulliken charges with hydrogens summed into heavy atoms:
elementType: Br P O C C C C C C C C C C C C C C C C C C C C C C C C C C
charge: -0.012746 0.744672 -0.281519 -0.072352 -0.044437 -0.038021 -0.375713 0.001750 -0.021086 -0.023159 0.003485 -0.037259 0.018456 0.077446 0.000104 0.011314 0.005490 -0.000481 0.000384 0.002574 0.329895 0.017081 0.012768 0.003979 -0.092099 -0.110144 0.052875 0.037623 -0.210879
polarizability: 3.87584570e+02 -1.00458972e+01 3.15729152e+02 2.36233443e+01 -1.71792043e+01 2.66809086e+02
1716.lowfreq: -12.8869 -3.2844 -0.0003 0.0002 0.0005 3.8083 12.1108 16.7631 33.8854
frequency: 11.9300 16.2606 33.8563 36.5900 45.0819 50.0272 54.8451 61.7472 68.9604 77.9038 86.2743 111.4453 141.7087 183.2180 187.9503 210.0391 220.5947 228.3620 234.5096 248.1179 262.8590 267.7531 279.1786 320.3036 396.4679 401.5576 403.2409 406.2741 414.4599 424.5698 441.0624 453.9359 492.3535 502.7676 513.2353 551.9955 582.1989 609.1414 612.2423 612.6300 613.5833 621.3908 665.0889 683.3518 686.1536 698.1188 700.8766 704.5044 706.0522 721.9138 742.2183 756.2246 758.9446 761.4012 831.9660 846.9229 854.4254 862.7301 873.3164 879.7042 931.2939 940.1383 947.7267 956.2642 971.6799 981.5236 986.4304 986.7541 988.8446 991.4720 993.4280 995.3655 1002.6080 1007.1466 1009.8694 1017.7655 1019.3798 1020.7310 1054.1796 1069.1883 1077.2623 1079.9874 1083.0890 1085.7893 1086.5202 1102.8316 1112.6917 1175.3303 1176.5616 1176.9820 1180.1215 1187.7779 1195.4031 1200.2943 1251.7937 1287.7062 1306.3291 1313.5841 1319.1332 1338.7757 1359.7048 1375.0261 1376.6859 1377.9811 1379.4587 1423.5175 1426.2590 1428.0188 1463.2796 1463.7318 1467.7773 1469.9133 1493.4505 1571.1803 1583.3854 1584.0558 1585.5185 1586.3266 1592.2385 1593.7776 1595.2248 3111.9109 3127.8998 3130.6160 3131.4508 3136.8720 3138.3085 3140.7986 3144.1705 3146.7254 3150.0396 3150.8108 3151.8549 3155.2608 3156.7858 3162.6353 3165.1667 3166.3703 3169.4708 3171.7082 3172.3547
redmass: 6.4845 8.2682 6.0623 4.5074 4.3501 4.8219 6.4662 5.0273 5.0689 4.4730 5.2182 6.8397 8.6656 5.1770 4.7236 5.0808 10.1749 5.7878 5.5019 6.0503 5.6531 5.7282 4.9921 7.3907 2.8065 2.8631 3.0546 2.9620 5.2682 7.1631 4.4195 4.4532 4.2009 5.8559 4.3218 6.6654 3.7091 2.3850 6.3623 3.8366 6.1496 3.9242 6.4810 6.9321 6.5229 2.2079 2.4108 2.5938 2.4609 6.0064 3.1735 1.5262 1.4897 1.5484 1.2622 1.6925 1.2528 1.2702 1.3016 3.7430 1.3611 1.3510 1.3320 1.3631 1.3851 1.4443 5.2923 5.3495 5.3587 1.4838 4.7902 1.3925 1.3357 1.3186 1.3187 3.2878 3.4577 3.2617 2.7926 2.3534 1.7772 2.2870 1.8810 1.8703 1.8844 1.3825 2.7270 1.0567 1.0534 1.0545 1.1139 1.1284 1.1239 1.1273 1.3934 1.2464 1.3497 1.3459 1.3466 5.5386 5.3988 6.8853 8.0120 8.0806 4.0061 2.0921 2.1124 2.1203 2.2451 2.2420 2.0254 1.9802 8.1243 7.5511 5.8258 6.2703 5.9643 5.9907 5.8018 5.7898 5.8373 1.0896 1.0862 1.0854 1.0852 1.0882 1.0903 1.0883 1.0874 1.0921 1.0884 1.0954 1.0932 1.0867 1.0957 1.0960 1.0960 1.1012 1.1016 1.0973 1.1002
irintensity: 0.0184 0.2531 1.0996 0.1725 0.1216 0.1937 1.6341 0.2349 1.4632 0.3667 0.6102 0.3082 0.9044 0.5887 0.9348 5.9991 1.3837 0.2355 1.0230 1.2967 0.3429 0.4323 2.5207 4.4335 0.0697 0.3284 3.5661 0.5976 18.4278 7.7487 8.0506 8.9549 13.1295 64.0318 88.9381 80.6678 18.2397 2.6177 0.3515 4.0794 0.3349 5.8346 9.6900 14.7790 7.7683 43.3766 55.8786 30.5421 29.9300 6.2582 43.8323 20.9648 41.0128 49.9597 10.2518 55.5236 0.8618 1.3707 6.0138 47.7256 1.3361 0.8969 0.4369 3.7337 2.5459 1.5734 5.2940 2.9596 1.8124 1.9324 57.2757 1.3670 0.1128 0.1940 0.6653 1.0157 2.1758 4.5971 23.1383 53.2427 7.9253 13.6805 8.5835 7.9674 1.4888 12.0678 42.0986 0.4180 0.4307 0.3678 6.0558 6.1595 10.4587 1.9259 18.1484 0.3820 4.4389 5.3804 3.4163 295.4801 20.6079 0.1511 1.6946 1.0834 11.6296 19.1281 5.9267 31.9893 28.3895 30.9545 23.2115 12.8879 426.2411 9.4429 0.7622 51.3126 3.0546 2.3064 1.0646 2.1318 2.1915 0.9891 0.9229 0.0624 0.0479 1.2097 2.4008 3.4002 2.0530 5.3299 0.4143 22.0279 7.8563 0.4693 14.4593 20.6539 5.7585 36.1726 34.8309 3.9927 11.9501
temp: 298.150 k
press: 1.00000 atm
elementType: 35 15 8 6 6 6 6 6 6 6 6 6 6 6 6 6 6 6 6 6 6 6 6 6 6 6 6 6 6 1 1 1 1 1 1 1 1 1 1 1 1 1 1 1 1 1 1 1 1
symmnumber: 1
zpe: 981021.6 jmol-1
zpe.correction: 0.373651 hartree
zpe.thermalcorrener: 0.399641 hartree
zpe.thermalcorrenthalpy: 0.400586 hartree
zpe.thermalcorrgfe: 0.313350 hartree
zpe.sumelectzpe: -1430.637918 hartree
zpe.sumelectthermal: -1430.611928 hartree
zpe.sumelectthermalent: -1430.610984 hartree
zpe.sumelectthermalfe: -1430.698220 hartree
dipole: 5.9901 2.5096 -7.0008
dipole: 9.5494
quadrupole: -173.5615 -162.5114 -201.7256
quadrupole: -1.1131 2.7213 9.6299
quadrupole: 5.7047 16.7547 -22.4594 -1.1131 2.7213 9.6299
hfenergy: -1431.0115699 hartree
pointgroup: C01 [X(C26H20Br1O1P1)]
dipole: -2.7538561 0.0212298 -2.5556017 debye
polarizability: 371.6089398|-24.7038853|323.0589129|-27.8731144|30.7564395|275.4549559 unknown
InChI: InChI=1S/C26H20BrOP/c27-22-18-16-21(17-19-22)26(28)20-29(23-10-4-1-5-11-23,24-12-6-2-7-13-24)25-14-8-3-9-15-25/h1-20H
charge 0 multiplicity 1
49 atoms
Br 5.835296 -2.063404 -1.079313
P  -0.863433 0.302334 0.443068
O  1.635995 0.923591 3.57951
C  -2.51166 1.195361 0.528368
C  -1.293897 -1.450927 -0.1166
C  0.093711 1.074681 -0.982446
C  -0.138487 0.467572 2.056863
C  -3.630011 0.741185 -0.210438
C  -1.432015 -2.430142 0.894252
C  -0.108655 2.447047 -1.268607
C  -2.616534 2.361207 1.32807
C  -1.519943 -1.787682 -1.472825
C  1.048611 0.332267 -1.718683
C  1.244091 0.448961 2.445797
C  -4.850427 1.450768 -0.147075
C  -1.801253 -3.749592 0.550435
C  0.638712 3.071129 -2.291516
C  -3.84054 3.064129 1.390022
C  -1.881725 -3.11149 -1.813988
C  1.798569 0.963889 -2.735492
C  2.304634 -0.153968 1.541016
C  -4.958405 2.612502 0.651261
C  -2.024655 -4.091945 -0.804175
C  1.595635 2.332129 -3.025277
C  3.518759 0.5511 1.341314
C  2.172767 -1.452568 0.989898
C  4.558933 0.004113 0.560409
C  3.215748 -2.032821 0.228617
C  4.388057 -1.284302 0.008888
H  -0.852861 0.803124 2.816292
H  -3.563039 -0.167897 -0.816398
H  -1.243946 -2.14902 1.938964
H  -0.846391 3.028727 -0.706184
H  -1.751123 2.708203 1.903706
H  -1.406779 -1.033192 -2.25959
H  1.225196 -0.724091 -1.496924
H  -5.714983 1.091698 -0.715759
H  -1.909525 -4.506706 1.33458
H  0.474709 4.131545 -2.51143
H  -3.917717 3.960726 2.014268
H  -2.049995 -3.375496 -2.863814
H  2.54627 0.386232 -3.289452
H  -5.906884 3.158518 0.700954
H  -2.304557 -5.116909 -1.07172
H  2.179714 2.819488 -3.813626
H  3.641419 1.530641 1.814613
H  1.266637 -2.036878 1.180124
H  5.484883 0.562035 0.393821
H  3.115895 -3.045872 -0.172377
