program: Gaussian 09
title: 000265863
version: EM64L-G09RevD.01
frameworkgroup: C1[X(C15H12FNO2)]
method: RPBEPBE
basis: SDD
operation: Freq
keyword: #p
keyword: freq=noraman
keyword: PBEPBE/SDD
title: #p freq=noraman PBEPBE/SDD
converged: YES YES NO NO
title: Mulliken charges:
elementType: F O O N C C C C C C C C C C C C C C C H H H H H H H H H H H H
charge: -0.205527 -0.427077 -0.251694 -0.450504 -0.322548 0.218053 0.222600 0.200897 0.201433 -0.539602 -0.385958 -0.558660 -0.362677 0.526544 -0.482296 0.347967 -0.382130 0.212479 -0.799890 0.256919 0.336507 0.241208 0.286440 0.244235 0.220462 0.255227 0.340913 0.310925 0.236572 0.271398 0.237784
chargesum: 0.00000
title: Mulliken charges with hydrogens summed into heavy atoms:
elementType: F O O N C C C C C C C C C C C C C C C
charge: -0.205527 -0.086164 -0.251694 -0.139579 -0.065629 0.218053 0.222600 0.200897 0.201433 -0.203095 -0.144750 -0.272220 -0.118442 0.526544 -0.261834 0.347967 -0.126903 0.212479 -0.054136
polarizability: 3.20715042e+02 2.76194673e+00 1.77778609e+02 -5.55581541e-01 6.32309836e+00 8.17626832e+01
1716.lowfreq: -76.5513 -6.6440 -3.0005 -0.0004 -0.0003 0.0008 1.2143 34.3301 55.5491
frequency: -76.5509 34.3297 55.5485 85.1077 92.8367 119.3155 131.8519 159.7846 177.9490 233.8065 260.5280 278.3503 321.2190 359.2535 364.9987 378.4113 395.9784 412.0673 448.7756 467.1902 515.9751 539.5320 557.2695 571.8794 590.7552 607.5523 622.6870 644.2331 670.5712 704.5581 723.7490 747.2003 774.9249 793.6027 821.6293 833.1582 883.0111 898.4247 927.8674 942.1677 944.7761 946.5193 955.5522 976.2037 988.0806 1004.4240 1030.4803 1093.4360 1119.1353 1130.0453 1148.8258 1192.2238 1199.5541 1206.4211 1220.1981 1235.4116 1261.8225 1277.7154 1301.2602 1354.6080 1365.4443 1375.9718 1378.5359 1430.5323 1444.8737 1453.3304 1460.7123 1468.4735 1490.2132 1511.6995 1596.1049 1600.3563 1619.6163 1627.9966 1635.1977 2987.5972 3025.2617 3072.4535 3111.5702 3137.4698 3142.7488 3147.1001 3171.1839 3177.0902 3189.0718 3520.7610 3547.4924
redmass: 1.0485 7.1266 5.5657 4.8411 5.9527 5.2805 3.9529 5.2468 6.8491 5.4080 4.7411 5.4717 3.4667 2.9149 1.9436 4.2652 4.3828 4.8780 3.4464 3.4870 5.2952 4.8673 4.6258 3.1889 3.6920 5.2031 4.4040 1.2289 4.6879 4.9167 5.6478 4.5507 4.0568 4.1698 1.4085 1.6871 1.8407 2.8988 6.0628 2.2301 1.4075 1.3737 1.4869 4.4734 2.8797 2.6728 1.6612 1.8492 2.0003 1.6816 1.4715 1.8344 1.5999 1.4030 2.4304 2.5493 1.5315 1.5892 3.1966 1.2039 3.8850 1.2882 5.4606 3.5664 1.8151 1.7778 3.6773 1.0469 4.1642 2.0523 7.1346 7.2649 7.5090 7.1071 5.1837 1.0384 1.0832 1.0984 1.0886 1.0978 1.0903 1.0952 1.0934 1.0957 1.0934 1.0764 1.0663
irintensity: 0.0199 0.0491 9.0365 0.4617 2.1130 1.0664 0.2534 0.4544 2.2203 0.7405 2.3094 0.9889 18.9860 16.1819 73.3494 17.8122 1.1359 8.3904 1.7447 28.4766 1.4513 1.6908 8.7653 0.7691 10.6667 12.6391 17.9859 56.2305 0.6887 8.5565 1.9428 6.1244 12.9328 40.2293 89.0001 6.5889 33.0819 16.4066 7.2391 6.5684 1.9868 0.4307 13.9120 53.5746 24.3760 10.0258 7.9160 17.2593 18.3549 19.3710 17.4205 21.3024 14.1896 22.4889 14.1223 174.4869 2.3877 13.2289 29.6432 25.1298 102.9276 74.0954 0.3430 185.4552 45.8389 29.0230 244.4881 20.1143 143.4097 187.9849 56.8794 23.3943 5.0519 37.6270 123.7619 9.4884 7.1096 15.1990 23.8088 6.6911 3.2138 19.5834 1.2001 7.7265 8.7833 12.9479 9.0422
temp: 298.150 k
press: 1.00000 atm
elementType: 9 8 8 7 6 6 6 6 6 6 6 6 6 6 6 6 6 6 6 1 1 1 1 1 1 1 1 1 1 1 1
symmnumber: 1
zpe: 612629.2 jmol-1
zpe.correction: 0.233338 hartree
zpe.thermalcorrener: 0.248852 hartree
zpe.thermalcorrenthalpy: 0.249796 hartree
zpe.thermalcorrgfe: 0.190071 hartree
zpe.sumelectzpe: -882.535901 hartree
zpe.sumelectthermal: -882.520388 hartree
zpe.sumelectthermalent: -882.519443 hartree
zpe.sumelectthermalfe: -882.579168 hartree
dipole: -3.5221 5.8540 0.8597
dipole: 6.8858
quadrupole: -102.5018 -108.0305 -109.1974
quadrupole: -11.1622 -1.2197 0.8468
quadrupole: 4.0748 -1.4540 -2.6208 -11.1622 -1.2197 0.8468
hfenergy: -882.7692391 hartree
pointgroup: C01 [X(C15H12F1N1O2)]
dipole: -1.3617755 -2.3058444 -0.4094778 debye
polarizability: 320.7559134|-1.0791642|177.1844029|-1.0347285|9.6249605|82.316018 unknown
InChI: InChI=1S/C15H12FNO2/c1-8(18)17-10-3-5-12-11-4-2-9(16)6-13(11)15(19)14(12)7-10/h2-7,15,17,19H,1H3
charge 0 multiplicity 1
31 atoms
F  5.726756 0.749968 0.078282
O  0.585676 2.63777 -0.55012
O  -4.399026 1.641035 0.300817
N  -3.923152 -0.638498 -0.008771
C  0.731231 1.484038 0.3537
C  -0.318529 0.381913 0.176768
C  2.04597 0.713638 0.199269
C  0.321575 -0.881507 0.01335
C  1.785793 -0.679631 0.026528
C  -1.712212 0.520386 0.177953
C  -0.462005 -2.043623 -0.144264
C  3.354846 1.217535 0.220071
C  2.854474 -1.591014 -0.115553
C  -2.499964 -0.656453 0.010139
C  -1.866793 -1.923466 -0.144448
C  4.396071 0.27954 0.066732
C  4.182844 -1.102653 -0.09492
C  -4.79169 0.451279 0.130615
C  -6.270783 0.069065 0.05783
H  0.656173 1.949999 1.353663
H  -2.199041 1.489937 0.296963
H  -0.000843 -3.029422 -0.267013
H  3.57061 2.282794 0.340056
H  2.673713 -2.663417 -0.243116
H  -2.484647 -2.822567 -0.2679
H  5.041948 -1.770741 -0.204246
H  0.588063 2.30684 -1.485169
H  -4.36846 -1.550302 -0.139706
H  -6.517397 -0.408056 -0.908882
H  -6.872243 0.98289 0.163742
H  -6.545758 -0.631878 0.86783
