program: Gaussian 09
title: 000024653
version: EM64L-G09RevD.01
frameworkgroup: C1[X(C3H5Cl2F)]
method: RPBEPBE
basis: SDD
operation: Freq
keyword: #p
keyword: freq=noraman
keyword: PBEPBE/SDD
title: #p freq=noraman PBEPBE/SDD
converged: NO NO NO NO
title: Mulliken charges:
elementType: Cl Cl F C C C H H H H H
charge: 0.041101 0.041111 -0.122890 -0.314362 -0.193071 -0.647140 0.249092 0.249094 0.228965 0.234049 0.234050
chargesum: 0.00000
title: Mulliken charges with hydrogens summed into heavy atoms:
elementType: Cl Cl F C C C
charge: 0.041101 0.041111 -0.122890 0.183824 -0.193071 0.049925
polarizability: 4.64680068e+01 1.39281683e-03 5.95578170e+01 2.87643672e+00 -1.61039251e-04 4.63270488e+01
1716.lowfreq: -21.5617 -0.0028 0.0027 0.0027 7.1358 10.8197 108.8183 190.0214 214.2856
frequency: 108.6816 190.0214 214.2381 255.1525 287.5743 359.9459 368.5530 472.7637 507.5342 650.8374 829.7324 892.2079 997.7548 1091.4602 1118.8241 1122.2802 1266.3428 1336.4799 1399.0506 1445.7663 1473.1198 1487.6843 2994.5265 2998.2044 3056.9147 3092.8162 3100.9624
redmass: 2.4270 5.6272 1.3002 9.4073 2.7397 6.3424 11.2404 4.2971 7.5393 3.3965 1.2749 2.6527 4.7618 2.3821 1.6499 3.1217 1.1426 1.4837 1.1985 1.0776 1.0387 1.0531 1.0358 1.0591 1.1017 1.0995 1.1013
irintensity: 0.0059 0.3135 0.0178 0.4137 1.0460 2.7972 5.2658 8.7858 21.9780 137.8751 83.7170 120.3882 89.2761 15.7569 35.0328 37.2595 16.4221 14.4459 20.0603 7.6477 15.0892 16.7930 22.1093 6.7973 2.0622 21.1677 20.5669
temp: 298.150 k
press: 1.00000 atm
elementType: 17 17 9 6 6 6 1 1 1 1 1
symmnumber: 1
zpe: 198098.2 jmol-1
zpe.correction: 0.075452 hartree
zpe.thermalcorrener: 0.082604 hartree
zpe.thermalcorrenthalpy: 0.083548 hartree
zpe.thermalcorrgfe: 0.043563 hartree
zpe.sumelectzpe: -1136.788332 hartree
zpe.sumelectthermal: -1136.781180 hartree
zpe.sumelectthermalent: -1136.780236 hartree
zpe.sumelectthermalfe: -1136.820221 hartree
dipole: 2.8098 -0.0002 0.3618
dipole: 2.8330
quadrupole: -48.0728 -49.9481 -50.1483
quadrupole: -0.0002 2.1828 -0.0002
quadrupole: 1.3170 -0.5584 -0.7586 -0.0002 2.1828 -0.0002
hfenergy: -1136.8637839 hartree
pointgroup: C01 [X(C3H5Cl2F1)]
dipole: -1.0696609 -0.0001117 0.3132163 debye
dipolederiv: -0.2030953 -0.08627 0.0758056 -0.0554188 -0.6407176 0.2552799 0.0664706 0.2774033 -0.3361481 -0.2031073 0.0863152 0.0758468 0.0554656 -0.6406338 -0.2553026 0.0665109 -0.2774314 -0.3362031 -0.6469305 0.0000011 -0.3750207 -0.0000054 -0.3391084 -0.0000044 -0.242419 0.0000069 -0.6888373 -0.1084445 0.0000057 -0.0271801 -0.0000073 -0.1217404 -0.0000074 0.1577135 0.0000102 -0.0957971 1.0104443 -0.000052 0.1643235 -0.0000391 1.667516 0.0000276 -0.0689454 0.0000121 1.3268272 -0.0197613 -0.0000022 -0.0377372 -0.0000057 0.0579292 -0.0000033 0.0045591 -0.0000033 0.0065053 0.0315694 -0.0172111 0.0150634 0.0221846 -0.0085438 0.1070144 -0.009413 0.0988996 0.0270121 0.031574 0.0172131 0.0150779 -0.0221779 -0.0085262 -0.1070135 -0.0094009 -0.0989018 0.0269949 -0.1093055 -0.0000279 0.089251 -0.0000325 0.1191487 0.0000177 0.1128859 0.00002 0.0242598 0.10853 0.0366422 0.0022991 -0.0150927 -0.0426441 -0.1065376 -0.0389724 -0.0890629 0.0226772 0.1085269 -0.0366141 0.0022707 0.0151292 -0.0426797 0.1065294 -0.0389894 0.0890473 0.022709 unknown
polarizability: 45.5773161|-0.0005304|59.5578171|-2.7579174|0.00038|47.2177393 unknown
InChI: InChI=1S/C3H5Cl2F/c1-2-3(4,5)6/h2H2,1H3
charge 0 multiplicity 1
11 atoms
Cl 0.674367 1.523146 -0.91721
Cl 0.674556 -1.52292 -0.917379
F  1.403994 0.00004 1.133441
C  -0.988563 -0.000089 0.784169
C  0.391207 0.000028 0.130728
C  -2.172203 -0.000133 -0.198531
H  -1.023195 -0.893565 1.437328
H  -1.023312 0.893335 1.437393
H  -3.118529 -0.000282 0.371141
H  -2.15897 -0.895812 -0.843962
H  -2.159153 0.895652 -0.843818
