program: Gaussian 09
title: 000265856
version: EM64L-G09RevD.01
frameworkgroup: C1[X(C14H5Br2NO4)]
method: RPBEPBE
basis: SDD
operation: Freq
keyword: #p
keyword: freq=noraman
keyword: PBEPBE/SDD
title: #p freq=noraman PBEPBE/SDD
converged: YES YES NO NO
title: Mulliken charges:
elementType: Br Br O O O O N C C C C C C C C C C C C C C H H H H H
charge: 0.077072 0.060354 -0.121483 -0.121796 -0.158112 -0.173185 -0.027963 0.295242 0.391116 0.216532 0.210405 0.247935 -0.187527 -0.215016 -0.350541 -0.316448 -0.308583 -0.289558 -0.245465 -0.191968 -0.238960 0.264348 0.313674 0.308299 0.296212 0.265419
chargesum: 0.00000
title: Mulliken charges with hydrogens summed into heavy atoms:
elementType: Br Br O O O O N C C C C C C C C C C C C C C
charge: 0.077072 0.060354 -0.121483 -0.121796 -0.158112 -0.173185 -0.027963 0.295242 0.391116 0.216532 0.210405 0.247935 -0.187527 -0.215016 -0.086194 -0.002774 -0.000284 0.006653 -0.245465 0.073451 -0.238960
polarizability: 3.92789982e+02 4.26554321e+00 2.22266918e+02 -8.02413131e+00 1.14503010e+01 8.48623939e+01
1716.lowfreq: -5.6994 -3.4087 -2.0831 -0.0007 -0.0003 -0.0002 23.2658 41.7142 51.1926
frequency: 23.2649 41.7102 51.1902 59.9680 94.4452 107.6615 131.1579 143.5335 161.4482 165.2888 169.8498 217.2561 269.4978 299.3842 319.5778 338.8156 355.5479 363.3673 373.8968 414.2711 425.3745 451.9334 464.9037 503.5711 553.5514 561.0286 591.6786 632.9104 653.5620 688.2277 693.2775 709.5394 732.4703 740.9836 795.0122 831.8768 835.7102 844.3310 907.7207 936.5417 947.9563 950.5943 974.7454 990.6467 1031.7382 1081.5324 1104.7431 1131.0568 1170.5660 1214.2576 1225.1439 1244.0884 1266.2149 1288.7344 1352.6098 1367.1608 1373.0698 1388.1907 1402.1789 1436.7143 1481.8886 1538.6414 1558.2836 1562.9403 1574.6192 1584.7587 1615.4304 3164.2348 3165.3880 3167.7868 3181.9410 3187.4618
redmass: 23.7987 12.7237 12.0464 14.8590 14.4577 11.7524 10.6825 8.1043 8.8564 13.1945 7.1172 8.2615 14.7027 7.3504 10.1288 7.5974 11.4643 6.6631 6.8770 8.9246 7.4325 4.3600 8.1990 8.3218 4.3542 4.2816 6.9981 7.5542 7.2747 9.8337 10.9825 5.5853 6.1024 5.4311 7.8740 3.6057 6.8109 1.7735 1.5442 1.6505 3.6305 1.7060 1.3791 7.2962 8.3951 2.0851 1.7409 2.2668 4.0323 2.0642 5.5518 2.0244 2.2589 1.7647 4.4685 10.6265 12.3165 4.0068 6.4447 3.0527 2.9405 8.2364 9.1504 9.1967 8.4473 7.8271 10.5121 1.0929 1.0929 1.0893 1.0932 1.0966
irintensity: 0.5785 0.3562 1.0904 0.5426 2.9239 0.6926 0.9915 0.2407 2.2394 0.6065 0.1780 0.3540 6.1768 0.8586 14.8984 5.1092 3.4489 3.0688 0.1271 4.7653 2.6490 17.4545 0.3447 0.1874 6.0008 4.9802 3.9987 1.1280 7.9727 23.8289 52.1117 31.7637 18.3073 11.3987 1.6076 8.3382 16.8370 22.7218 16.8592 17.8882 13.9667 7.8562 0.2825 8.8188 13.9054 24.6923 30.0921 7.3269 66.0473 70.5907 197.8958 38.6921 44.0192 0.6527 18.8982 43.6328 121.6323 61.2119 7.4102 191.7664 6.5256 1.6605 162.3179 123.2235 48.8503 27.7862 13.4284 4.8138 5.2016 1.3762 3.7149 2.7617
temp: 298.150 k
press: 1.00000 atm
elementType: 35 35 8 8 8 8 7 6 6 6 6 6 6 6 6 6 6 6 6 6 6 1 1 1 1 1
symmnumber: 1
zpe: 409007.1 jmol-1
zpe.correction: 0.155783 hartree
zpe.thermalcorrener: 0.173363 hartree
zpe.thermalcorrenthalpy: 0.174307 hartree
zpe.thermalcorrgfe: 0.107127 hartree
zpe.sumelectzpe: -917.530092 hartree
zpe.sumelectthermal: -917.512512 hartree
zpe.sumelectthermalent: -917.511567 hartree
zpe.sumelectthermalfe: -917.578747 hartree
dipole: 0.8123 -2.3592 -1.5724
dipole: 2.9493
quadrupole: -128.3295 -163.1951 -140.3769
quadrupole: 3.6043 3.9803 1.2042
quadrupole: 15.6376 -19.2279 3.5903 3.6043 3.9803 1.2042
hfenergy: -917.6858745 hartree
pointgroup: C01 [X(C14H5Br2N1O4)]
dipole: 0.3904399 0.9076982 0.608302 debye
dipolederiv: -0.8898409 0.1000398 -0.0939175 0.1143525 -0.0251457 0.0161565 -0.0978373 0.0149174 0.0073025 -0.9612201 0.1402788 0.00637 0.124691 -0.0397396 -0.0073815 0.0198554 -0.0114575 0.0027303 -0.4415553 0.1521261 -0.014042 -0.0206018 -0.8855849 0.0440379 -0.0482847 0.0684041 -0.2722891 -0.4699283 -0.2705447 -0.0852575 -0.0259652 -0.812451 -0.1510223 -0.0518133 -0.1516775 -0.3141548 -0.3559544 0.0208771 -0.2572963 0.0014046 -0.5231548 0.1152812 -0.1857086 0.020123 -0.5522184 -0.2962793 -0.0921479 -0.1514812 -0.1997749 -0.7317699 -0.1495989 -0.1304585 -0.0404209 -0.4440278 0.3422004 -0.0402343 0.4908209 0.1764593 1.3525659 -0.0133455 0.3819654 0.0135519 0.8568549 0.6726305 0.0328535 -0.0682278 0.0588387 0.163334 -0.0232131 -0.1636866 0.1080198 -0.0074419 -0.1035587 0.0323091 0.013205 -0.158402 0.1174625 0.0516471 -0.0855592 0.0133332 0.0311247 -0.3969017 -0.3171464 -0.0059888 -0.0500308 -0.4319348 0.0041576 0.0213423 -0.0179647 0.0204819 -0.0163677 0.2723461 0.0376178 0.28661 -0.5365157 -0.1196871 0.0274441 -0.0741683 0.0036668 -0.0844803 0.0715944 -0.0548984 -0.0929386 -0.2186261 0.011767 0.0562147 -0.032011 -0.0213589 0.5587378 0.2417344 0.0344066 0.2700655 1.1588335 -0.0524785 0.1210674 -0.0287077 0.1754367 0.465971 -0.0415455 0.0551137 -0.1496742 1.1956208 0.2547712 0.0532911 0.188074 0.2199699 -0.0955976 0.2416907 0.0453198 0.0095691 -0.030466 0.022519 0.0341413 -0.0073627 -0.0672975 -0.4056054 0.134995 -0.0627601 -0.1626664 0.061676 -0.0040342 -0.037192 0.0189934 -0.0185978 -0.600024 0.0240634 -0.01717 0.4209903 -0.008694 0.0124176 0.1042247 -0.0075643 -0.0286152 -0.3361791 -0.0241673 -0.0327084 0.1582026 -0.0204288 0.0256671 -0.0684746 -0.0761007 0.0041355 1.6339855 -0.2018873 0.2125146 -0.2018306 -0.1510166 -0.0155413 0.2301232 -0.0279965 -0.1232582 -0.3488214 -0.1512627 -0.0258086 -0.0594446 0.0581026 0.0437188 -0.0404549 0.0364123 -0.0389309 1.6959278 -0.2688356 -0.0083971 -0.4647688 0.0138199 0.0100882 -0.0547685 0.0325209 -0.137826 0.0211371 -0.0741923 -0.0364944 -0.0567022 0.0256635 -0.0390512 -0.0158439 -0.0284198 0.1141946 0.1367486 -0.0047454 -0.0006951 0.0672141 0.0858922 0.0066814 -0.0184736 -0.0027953 0.1497546 0.1014984 -0.0077303 -0.0014221 -0.0635746 0.0825251 -0.0106251 -0.0250157 -0.0021167 0.1520278 0.1034216 -0.0111811 0.0082481 -0.0407873 0.0812535 0.0049759 -0.0274226 0.0336888 0.1459591 0.0700553 0.0407125 0.0129487 0.0587644 0.0187785 -0.0379083 0.0013242 -0.0392752 0.142377 unknown
polarizability: 389.6379864|-20.4458044|225.0779027|18.0495388|6.726216|85.2034045 unknown
InChI: InChI=1S/C14H5Br2NO4/c15-6-1-2-8-9(3-6)13(18)14(19)10-4-7(16)5-11(12(8)10)17(20)21/h1-5H
charge 0 multiplicity 1
26 atoms
Br 5.373743 -0.57512 0.481824
Br -5.61993 0.816753 0.102203
O  0.780354 -3.551194 0.155083
O  -1.87744 -3.159236 -0.694937
O  0.476208 2.731741 -1.564233
O  1.701607 3.55983 0.178532
N  1.211209 2.588753 -0.516401
C  0.629368 0.145512 -0.025699
C  -0.843994 0.324608 0.039084
C  1.189519 -1.169126 0.083564
C  -1.705568 -0.797616 -0.180926
C  1.583893 1.200918 -0.121042
C  0.325412 -2.387986 -0.003451
C  -1.169417 -2.177539 -0.345639
C  -1.455739 1.563966 0.367534
C  2.58295 -1.386946 0.217756
C  -3.115625 -0.65112 -0.176414
C  2.970412 1.011163 0.047377
C  3.4626 -0.294085 0.239211
C  -2.856228 1.710805 0.397589
C  -3.68058 0.603906 0.095579
H  -0.858555 2.436766 0.639078
H  2.935424 -2.419435 0.301841
H  -3.729606 -1.536523 -0.366709
H  3.638202 1.875417 0.00248
H  -3.297922 2.677187 0.655013
