program: Gaussian 09
title: 000265843
version: EM64L-G09RevD.01
frameworkgroup: C1[X(C14H6Br2O2)]
method: RPBEPBE
basis: SDD
operation: Freq
keyword: #p
keyword: freq=noraman
keyword: PBEPBE/SDD
title: #p freq=noraman PBEPBE/SDD
converged: YES YES YES YES
title: Mulliken charges:
elementType: Br Br O O C C C C C C C C C C C C C C H H H H H H
charge: 0.044692 0.044692 -0.126867 -0.126866 0.389560 0.389559 0.231057 0.231057 -0.234172 -0.234173 -0.371146 -0.371147 -0.299816 -0.299817 -0.192341 -0.192340 -0.243561 -0.243561 0.235655 0.235656 0.307618 0.307618 0.259321 0.259321
chargesum: 0.00000
title: Mulliken charges with hydrogens summed into heavy atoms:
elementType: Br Br O O C C C C C C C C C C C C C C
charge: 0.044692 0.044692 -0.126867 -0.126866 0.389560 0.389559 0.231057 0.231057 -0.234172 -0.234173 -0.135491 -0.135491 0.007802 0.007801 0.066980 0.066981 -0.243561 -0.243561
polarizability: 3.80134534e+02 -2.85987319e-03 1.94515173e+02 2.13161797e-03 -2.41468954e-02 6.40496559e+01
1716.lowfreq: -6.1268 -3.0120 -0.0006 -0.0005 0.0002 9.0649 30.7609 38.4391 80.4612
frequency: 30.7365 38.4355 80.4612 87.6485 136.1723 140.1507 155.5429 165.7890 217.7737 280.1567 329.3310 338.6020 341.3899 362.9250 379.8969 394.3026 436.8592 457.5917 461.4680 500.5716 561.7578 577.7502 622.2316 637.4725 680.8491 689.1002 727.2614 730.4175 793.4170 833.4132 837.9084 897.7895 927.7652 941.6829 966.5207 970.4308 976.2880 991.8300 1013.8044 1077.7735 1079.2632 1121.0999 1140.9789 1205.0473 1231.6745 1261.3791 1266.3351 1302.7530 1361.6178 1369.1479 1390.2319 1407.3039 1452.0462 1493.7783 1546.4958 1559.5628 1566.8611 1581.9231 1590.3210 1614.4154 3154.4980 3160.6911 3162.6464 3163.2716 3175.7963 3180.1204
redmass: 11.7236 10.4492 5.9852 17.6778 6.1549 5.7232 13.3333 38.4529 7.0594 13.6992 5.6746 8.2836 4.9274 15.5003 4.7502 8.1802 4.0908 8.8181 3.8660 8.0481 3.1069 6.1540 6.3007 7.4404 7.0689 9.6560 3.3737 4.1594 7.6099 1.3242 1.8075 2.1689 8.2843 1.4275 1.7650 1.9253 1.3609 7.1066 8.0591 1.8442 2.1336 2.6493 1.7087 2.5906 1.7281 1.3455 2.0350 1.9763 4.8014 9.3258 4.2160 6.3541 2.3302 2.9336 8.2668 10.6502 8.1038 8.6587 6.4383 9.9650 1.0885 1.0876 1.0926 1.0926 1.0972 1.0954
irintensity: 0.3483 0.0000 0.0000 0.0326 1.3522 0.0000 0.6513 0.0012 0.0177 9.2603 0.1633 12.7711 0.0000 4.1724 1.7402 2.1557 0.0000 0.0220 38.7981 0.2853 0.0000 1.6169 0.0717 4.2093 0.3234 92.6568 0.0000 11.7804 1.5727 72.7314 0.0000 0.0000 24.9838 20.7310 0.0000 0.0000 1.8325 18.3828 5.3368 70.0071 0.4722 1.0475 27.3600 127.2024 51.6470 12.2645 54.6074 1.9151 14.5269 39.0839 107.8402 4.5180 177.9127 0.1235 19.1232 267.9090 29.0344 9.5073 0.5560 4.6006 6.6630 0.3094 0.5495 6.6036 0.0480 14.7450
temp: 298.150 k
press: 1.00000 atm
elementType: 35 35 8 8 6 6 6 6 6 6 6 6 6 6 6 6 6 6 1 1 1 1 1 1
symmnumber: 1
zpe: 408707.3 jmol-1
zpe.correction: 0.155668 hartree
zpe.thermalcorrener: 0.170336 hartree
zpe.thermalcorrenthalpy: 0.171280 hartree
zpe.thermalcorrgfe: 0.111032 hartree
zpe.sumelectzpe: -713.249779 hartree
zpe.sumelectthermal: -713.235112 hartree
zpe.sumelectthermalent: -713.234168 hartree
zpe.sumelectthermalfe: -713.294416 hartree
dipole: 0.0000 -6.6420 0.0017
dipole: 6.6420
quadrupole: -124.6507 -128.6044 -123.2908
quadrupole: 0.0000 -0.0014 0.0024
quadrupole: 0.8646 -3.0891 2.2245 0.0000 -0.0014 0.0024
hfenergy: -713.4054479 hartree
pointgroup: C01 [X(C14H6Br2O2)]
dipole: 0.0000052 -2.6131449 0.000652 debye
dipolederiv: -0.9676598 0.0593813 0.0000096 0.0234081 -0.0352615 0.0000011 -0.0000097 0.0000657 -0.008586 -0.9677234 -0.0593602 -0.0000287 -0.023424 -0.0352653 0.0000082 -0.0000155 0.0000044 -0.0085747 -0.4797657 -0.2380968 -0.0000347 -0.0214001 -0.869309 -0.0000737 0.0000708 0.0002012 -0.2772135 -0.4798106 0.2380192 -0.0000882 0.0215891 -0.8692838 0.0002682 0.0000151 0.0000999 -0.2772003 0.339228 0.0245237 0.0000331 -0.1666017 0.1201075 0.0000014 0.0000563 -0.0000564 0.0202724 0.3392111 -0.0244319 -0.0000023 0.1665152 0.1200056 -0.0000648 -0.0000381 -0.0000332 0.0202762 -0.1918036 0.3219308 -0.0000898 0.2034233 -0.5122393 0.0000761 0.0000208 0.0000734 0.0094685 -0.1917049 -0.3220184 0.0000926 -0.203493 -0.5121792 0.0000463 0.0000634 0.0000797 0.0094787 0.5267235 -0.1198645 0.0000667 -0.1958274 1.1984341 -0.0000816 -0.0001182 -0.0002768 0.1664997 0.5268251 0.1199786 0.0000526 0.1956876 1.1983399 -0.000267 -0.0000844 -0.0001242 0.1664718 -0.3154431 0.1921801 -0.0000302 0.1294438 0.0162287 0.0000281 0.0000021 0.0000285 -0.1312766 -0.3153077 -0.1922456 0.0000841 -0.1293572 0.0162539 -0.0000411 0.0000456 -0.000018 -0.131277 -0.5905504 -0.049277 0.0000489 0.3302996 0.0366296 0.0000752 0.0000135 -0.0000324 -0.0236143 -0.5907914 0.0491507 -0.000053 -0.3301236 0.0367848 -0.0000059 0.000078 0.0000328 -0.0236235 -0.2057286 -0.1279407 0.0000228 -0.0343011 0.0784688 -0.0000031 0.0000069 -0.0000074 -0.0594659 -0.205937 0.1279924 -0.0000842 0.0342567 0.0785208 -0.0000538 -0.0000387 -0.0000323 -0.0594711 1.6760717 -0.095488 -0.0000358 -0.3036911 -0.0879407 -0.0000604 -0.0000187 -0.0000608 -0.1495222 1.6763349 0.0954475 0.0000797 0.3035781 -0.0879688 -0.0000372 -0.0000291 -0.0000343 -0.1495275 0.0409035 -0.1013132 0.0000148 -0.0755547 -0.0273015 0.0000183 -0.0000215 0.0000135 0.1449076 0.0408862 0.1013048 -0.0000384 0.0755681 -0.0273178 0.000071 -0.0000299 0.0000338 0.1449108 0.1132579 -0.0068012 -0.0000301 -0.0774544 0.0770999 -0.0000155 0.0000214 0.0000095 0.1526445 0.1133428 0.0069094 -0.0000001 0.0774045 0.0770026 0.0000132 -0.0000276 0.0000082 0.1526452 0.0547 0.0614251 -0.0000188 0.0742553 0.0051122 0.000027 0.0000048 -0.0000011 0.1558864 0.0547417 -0.0614061 0.0000293 -0.074201 0.0050784 0.0000699 0.0000327 0.0000263 0.1558909 unknown
polarizability: 380.1345339|-0.0024809|194.5151729|0.0021317|-0.0241469|64.0496559 unknown
InChI: InChI=1S/C14H6Br2O2/c15-7-1-3-9-10-4-2-8(16)6-12(10)14(18)13(17)11(9)5-7/h1-6H
charge 0 multiplicity 1
24 atoms
Br 5.54872 -0.656683 0.000076
Br -5.548727 -0.656706 0.000002
O  1.398123 2.94611 -0.000425
O  -1.398144 2.946105 -0.000833
C  0.742225 -0.703554 0.000196
C  -0.742231 -0.703556 0.000194
C  1.469059 0.528696 0.000075
C  -1.469071 0.528691 -0.000139
C  0.776098 1.849398 0.000035
C  -0.776116 1.849396 -0.000476
C  1.496315 -1.907915 0.000244
C  -1.496317 -1.907921 0.000509
C  2.888173 0.542944 0.000038
C  -2.888185 0.542933 -0.000204
C  2.904819 -1.902155 0.000208
C  -2.904821 -1.902166 0.000463
C  3.593633 -0.66788 0.000115
C  -3.59364 -0.667894 0.000089
H  0.994895 -2.879195 0.000281
H  -0.994894 -2.879199 0.000815
H  3.395188 1.512614 -0.000043
H  -3.395203 1.512601 -0.000477
H  3.458963 -2.845026 0.000241
H  -3.458961 -2.84504 0.000715
