program: Gaussian 09
title: 000265982
version: EM64L-G09RevD.01
frameworkgroup: C1[X(C22H28N2O4S)]
method: RPBEPBE
basis: SDD
operation: Freq
keyword: #p
keyword: freq=noraman
keyword: PBEPBE/SDD
title: #p freq=noraman PBEPBE/SDD
converged: YES YES NO NO
title: Mulliken charges:
elementType: S O O O O N N C C C C C C C C C C C C C C C C C C C C C C H H H H H H H H H H H H H H H H H H H H H H H H H H H H
charge: 0.864612 -0.254544 -0.254571 -0.543902 -0.533285 -0.465188 -0.465209 0.144203 0.144277 0.161226 0.161206 -0.695008 -0.692585 -0.757097 -0.692528 -0.757049 -0.695139 -0.094670 -0.094648 0.507778 0.507805 -0.213941 -0.215484 -0.235870 -0.234384 -0.447838 -0.447965 -0.326185 -0.326161 0.257465 0.211276 0.211943 0.212278 0.255941 0.213249 0.214970 0.240866 0.211781 0.255909 0.212303 0.213249 0.240859 0.215010 0.211743 0.211259 0.257536 0.211917 0.339617 0.339607 0.279436 0.280125 0.276832 0.276211 0.230221 0.230265 0.320141 0.320134
chargesum: 0.00000
title: Mulliken charges with hydrogens summed into heavy atoms:
elementType: S O O O O N N C C C C C C C C C C C C C C C C C C C C C C
charge: 0.864612 -0.254544 -0.254571 -0.543902 -0.533285 -0.125572 -0.125602 0.144203 0.144277 0.161226 0.161206 -0.014324 -0.011117 -0.089480 -0.011067 -0.089437 -0.014426 -0.094670 -0.094648 0.507778 0.507805 0.065494 0.064641 0.040962 0.041828 -0.217617 -0.217699 -0.006043 -0.006027
polarizability: 4.23717056e+02 -7.55317445e-02 2.63920819e+02 -3.45988510e-01 1.39342959e+01 2.62257708e+02
1716.lowfreq: -5.1803 -3.1651 -0.0004 0.0013 0.0015 0.8502 9.3397 10.3317 15.1851
frequency: 9.0220 9.9659 15.0732 27.5393 31.4549 38.5089 55.2715 66.6436 74.2516 81.1890 81.7911 131.8646 137.8656 145.8679 162.3020 175.2885 182.5076 203.3672 206.1692 241.3190 252.5394 254.4493 264.2590 265.3994 275.8574 283.0186 288.4122 300.0423 312.1720 313.4992 327.9089 330.4846 344.6928 354.5586 354.8305 362.0949 369.8796 372.4035 403.8143 413.9006 414.9671 424.9030 441.5106 455.6913 487.5253 534.7259 539.1203 558.0424 561.7827 620.0463 621.7244 632.0909 644.5191 665.7657 666.6098 721.8929 722.1038 734.3710 734.5260 775.8291 786.1705 791.1805 830.8836 832.1489 835.1043 839.3080 871.0436 877.9988 894.0960 894.6097 923.0447 927.6019 927.9964 937.5029 937.8038 950.4183 950.7765 958.5128 962.6635 988.0851 990.8809 998.4507 1001.6080 1020.4346 1020.6414 1023.8797 1024.2269 1051.4751 1057.5733 1113.8972 1119.5574 1140.4242 1141.6742 1177.4120 1182.4548 1204.0734 1204.1225 1229.7013 1229.7742 1250.2366 1250.7547 1264.7753 1265.9658 1290.8273 1294.3169 1368.2410 1372.0192 1372.1856 1372.7168 1374.5090 1374.8300 1400.4313 1400.9368 1404.4996 1405.6816 1455.6860 1455.7436 1468.6568 1469.1476 1471.8457 1471.9231 1475.7700 1476.7940 1476.8974 1478.5624 1494.9087 1495.2189 1496.6372 1498.4053 1509.1354 1511.5003 1592.6401 1594.8185 1600.8955 1602.5179 1611.2443 1611.9355 2960.9305 2960.9439 2980.2895 2980.3461 2982.7640 2982.8085 3051.6286 3051.6456 3071.0565 3071.1516 3073.0469 3073.0716 3078.5259 3078.6022 3099.1873 3099.3534 3104.0860 3104.0987 3120.7039 3121.0286 3154.3992 3156.2858 3159.1162 3161.0333 3197.5332 3197.6431 3533.4870 3533.5674
redmass: 3.2186 3.6791 3.4026 4.5326 4.9876 4.7740 4.3235 5.0447 7.0983 5.1679 5.9568 5.4692 5.1128 5.8512 6.0072 7.9723 4.6679 1.1382 1.1506 3.1349 2.3930 1.3225 2.9770 1.3558 2.2290 3.7751 3.8194 3.2580 1.0848 1.1418 5.2419 3.5161 3.9460 3.2008 3.1856 3.8470 2.9197 2.9179 5.7040 2.9754 3.1263 5.8308 3.3327 3.4075 6.2354 2.9502 2.7378 3.6789 3.6403 6.9646 7.0011 6.1022 6.5107 1.1811 1.1812 5.8930 5.9846 3.6344 3.7098 8.6740 4.1553 4.9944 4.0183 3.8735 1.4053 1.4326 1.4463 1.4577 4.0007 3.9639 14.9540 1.7027 1.7036 1.5945 1.5956 1.2299 1.2289 1.3742 1.3744 5.2341 4.9724 1.3351 1.3314 1.4196 1.4190 1.3893 1.3897 2.4148 2.4617 1.3269 1.3491 2.9583 2.8817 1.1310 1.1260 2.9782 2.9812 2.9785 2.9831 2.9974 2.9724 1.9808 1.9766 1.4246 1.4233 4.3128 1.2134 1.2089 3.5587 1.2021 1.2007 1.5382 1.4030 2.6994 3.2788 1.0478 1.0478 1.1588 1.1359 1.0495 1.0490 2.1526 1.0726 1.0733 2.1402 1.1269 1.0630 1.2523 1.2537 1.4204 1.5919 7.3717 6.8787 5.7407 6.5061 4.4726 4.3621 1.0371 1.0371 1.0350 1.0350 1.0359 1.0359 1.1005 1.1005 1.0973 1.0973 1.1005 1.1005 1.0987 1.0986 1.1003 1.1002 1.0994 1.0994 1.0898 1.0899 1.0910 1.0911 1.0949 1.0950 1.0950 1.0950 1.0757 1.0757
irintensity: 0.2890 0.2136 0.5716 1.3705 3.8700 1.2791 0.0350 3.8238 4.1907 0.7239 1.5546 0.3379 3.3143 1.7509 0.4127 1.4664 0.4983 1.0564 0.1518 19.6370 2.9829 3.6094 3.6874 0.0983 5.5510 7.2879 1.2933 18.9114 0.5774 4.0924 7.0045 0.1166 0.3387 15.7126 6.2333 3.5826 0.0068 0.2440 0.3623 0.0360 0.3837 11.1528 18.8985 4.1948 78.8881 83.8067 59.8803 10.7886 58.6690 0.8648 0.5412 3.8290 76.6889 31.5627 41.4672 0.6424 5.5661 7.3529 0.1018 74.8767 1.4609 49.3850 2.5704 7.3019 17.7224 30.2402 24.4019 58.6439 22.6327 57.8058 63.0203 3.5936 3.6262 2.6489 3.6097 0.5663 0.5556 3.0728 0.1685 0.6104 0.8234 3.7841 2.5149 1.3161 1.3332 0.8246 0.8223 71.5215 17.1024 15.8221 24.1776 156.5624 66.2062 51.6007 4.3922 3.7643 4.1036 6.8052 12.4692 41.6249 17.7671 41.5564 21.6189 38.7902 22.1666 247.6929 39.4537 32.0828 130.4633 30.6210 38.5159 45.6672 27.4109 10.2865 18.4834 0.8126 0.8537 29.9920 12.7242 3.1808 3.6644 147.3346 21.4054 39.0302 28.7431 214.8462 3.5402 372.2523 183.7280 183.5806 167.6520 77.2532 137.8041 26.4550 27.4499 28.6074 115.1267 7.0012 44.0420 32.5677 38.1067 37.0214 19.2009 15.3860 40.1156 10.0206 8.5258 19.9072 27.4526 129.5749 57.9760 4.3256 4.0985 6.3312 43.7421 18.0752 15.2244 1.5176 1.3267 9.4929 4.9564 10.1418 8.6808 33.7000 40.2703
temp: 298.150 k
press: 1.00000 atm
elementType: 16 8 8 8 8 7 7 6 6 6 6 6 6 6 6 6 6 6 6 6 6 6 6 6 6 6 6 6 6 1 1 1 1 1 1 1 1 1 1 1 1 1 1 1 1 1 1 1 1 1 1 1 1 1 1 1 1
symmnumber: 1
zpe: 1203745.8 jmol-1
zpe.correction: 0.458483 hartree
zpe.thermalcorrener: 0.489283 hartree
zpe.thermalcorrenthalpy: 0.490228 hartree
zpe.thermalcorrgfe: 0.392544 hartree
zpe.sumelectzpe: -1661.320503 hartree
zpe.sumelectthermal: -1661.289702 hartree
zpe.sumelectthermalent: -1661.288757 hartree
zpe.sumelectthermalfe: -1661.386441 hartree
dipole: -0.0276 -6.9907 7.9362
dipole: 10.5761
quadrupole: -123.1758 -211.5302 -179.8781
quadrupole: -0.1862 0.0084 -3.2856
quadrupole: 48.3522 -40.0021 -8.3501 -0.1862 0.0084 -3.2856
hfenergy: -1661.7789851 hartree
pointgroup: C01 [X(C22H28N2O4S1)]
dipole: 0.0225401 3.4014873 2.396414 debye
polarizability: 423.7161366|-0.4802943|257.5237919|0.1929997|-12.8016302|268.6556552 unknown
InChI: InChI=1S/C22H28N2O4S/c1-21(2,3)19(25)23-15-7-11-17(12-8-15)29(27,28)18-13-9-16(10-14-18)24-20(26)22(4,5)6/h7-14,23-24H,1-6H3
charge 0 multiplicity 1
57 atoms
S  -0.008374 -3.001243 0.646748
O  -5.419177 0.857598 -1.709689
O  5.408767 0.843344 -1.719947
O  -0.008283 -3.689098 2.136658
O  -0.014043 -3.859873 -0.747906
N  -4.937779 0.588151 0.565029
N  4.945456 0.55438 0.556093
C  -6.922385 1.971213 -0.116545
C  6.933001 1.931589 -0.129272
C  -5.694834 1.093946 -0.495964
C  5.696412 1.06608 -0.506433
C  -6.748415 3.333502 -0.84807
C  -8.180692 1.243497 -0.675238
C  -7.095269 2.216391 1.404119
C  8.181681 1.199141 -0.703416
C  7.11928 2.163267 1.391933
C  6.763626 3.300924 -0.848451
C  -1.514329 -1.859555 0.591369
C  1.505647 -1.870282 0.587988
C  -3.786277 -0.241691 0.519411
C  3.788292 -0.267669 0.512313
C  -2.069135 -1.438481 1.810684
C  2.074799 -1.466496 1.806515
C  -2.067116 -1.528966 -0.654966
C  2.049324 -1.53023 -0.65983
C  -3.211859 -0.619439 1.767197
C  3.223045 -0.655277 1.761224
C  -3.212601 -0.707053 -0.697611
C  3.200078 -0.715808 -0.704278
H  -6.593795 3.168184 -1.927186
H  -7.652573 3.953747 -0.707442
H  -5.879834 3.893872 -0.455096
H  -9.076257 1.874426 -0.526887
H  -8.059226 1.047325 -1.753731
H  -8.349963 0.277548 -0.16405
H  -6.229596 2.74907 1.844729
H  -7.979512 2.857694 1.568178
H  -7.277409 1.278387 1.965049
H  8.050823 1.013181 -1.782622
H  9.083057 1.822052 -0.55636
H  8.347269 0.227632 -0.201663
H  8.008204 2.79851 1.554155
H  6.259947 2.69669 1.843844
H  7.301052 1.219691 1.943582
H  7.673955 3.912768 -0.710914
H  6.598187 3.145478 -1.927422
H  5.903058 3.865117 -0.443469
H  -5.253545 0.84475 1.502584
H  5.270721 0.799892 1.493377
H  -1.633496 -1.769852 2.758797
H  1.64517 -1.805298 2.754768
H  -1.627337 -1.927705 -1.575226
H  1.598696 -1.915692 -1.580473
H  -3.667332 -0.278334 2.705337
H  3.689766 -0.327856 2.698705
H  -3.672749 -0.425589 -1.645806
H  3.65348 -0.427348 -1.653621
