program: Gaussian 09
title: 000265820
version: EM64L-G09RevD.01
frameworkgroup: C1[X(C12H8N4O)]
method: RPBEPBE
basis: SDD
operation: Freq
keyword: #p
keyword: freq=noraman
keyword: PBEPBE/SDD
title: #p freq=noraman PBEPBE/SDD
converged: NO YES NO NO
title: Mulliken charges:
elementType: O N N N N C C C C C C C C C C C C H H H H H H H H
charge: -0.181626 -0.257282 0.073486 0.079359 0.045709 0.242600 0.310282 -0.056052 -0.227272 -0.122509 -0.370773 -0.370762 -0.175204 -0.215037 -0.215060 -0.320909 -0.230726 0.278641 0.250577 0.250580 0.244082 0.236505 0.236499 0.257354 0.237537
chargesum: 0.00000
title: Mulliken charges with hydrogens summed into heavy atoms:
elementType: O N N N N C C C C C C C C C C C C
charge: -0.181626 -0.257282 0.073486 0.079359 0.045709 0.242600 0.310282 -0.056052 -0.227272 0.156132 -0.120195 -0.120182 0.068878 0.021469 0.021439 -0.063555 0.006811
polarizability: 2.10288429e+02 1.06064265e+01 1.89212605e+02 9.04171610e-03 3.35509909e-02 1.02274991e+02
1716.lowfreq: -47.4130 -8.0493 -0.0004 0.0002 0.0006 6.4569 6.7309 58.8383 68.3663
frequency: -47.3955 58.8172 68.3475 87.0685 152.1085 173.1293 203.4983 228.4989 283.1927 306.4155 393.2713 395.6232 404.9660 459.6683 467.6789 541.5445 581.1611 603.3997 610.5877 613.0657 675.1377 700.2372 705.6418 738.8124 762.0300 785.2444 789.7122 821.6598 855.6631 889.2689 918.8011 933.3289 956.1356 970.4043 979.7393 988.2591 1002.7975 1012.6853 1030.9198 1080.2455 1089.5521 1109.3137 1176.0240 1189.6731 1192.1782 1214.7951 1279.8276 1312.1784 1337.4838 1366.1238 1370.2439 1374.0737 1420.2495 1429.7719 1452.0341 1472.7206 1493.6312 1521.9071 1582.8194 1601.4824 1614.2755 3131.6362 3136.6775 3147.1943 3148.5691 3157.4776 3170.6608 3171.3792 3198.7907
redmass: 3.9791 5.9798 5.3539 8.0179 9.2906 8.0144 5.4686 4.5250 7.5369 8.4445 8.8073 2.8309 4.9876 4.5639 4.2761 7.1104 4.2585 8.5329 7.1506 6.5326 7.2895 2.0677 10.0892 2.1409 4.2822 1.5515 3.6981 7.5912 1.2433 5.7278 1.3643 1.5300 1.3595 7.4390 1.3874 6.1196 1.3332 3.4302 2.1404 1.6123 2.3231 3.2772 1.0543 1.1169 2.1216 5.9657 4.6090 1.3754 2.3704 1.9278 6.6112 5.1118 3.8944 2.2009 2.6605 5.6735 5.9629 5.8883 5.8849 6.1036 6.3021 1.0852 1.0883 1.0928 1.0913 1.0971 1.0912 1.1018 1.1002
irintensity: 0.3326 1.6913 1.7365 0.9934 0.4305 0.0021 0.0037 1.5098 1.0226 0.0825 2.1558 0.0012 0.0269 3.2530 9.8595 1.2466 0.6197 2.6440 4.2017 0.2498 7.0120 28.9738 1.3878 74.2603 20.4610 43.9055 1.0477 34.0133 0.4332 15.1541 1.0050 5.4238 0.0991 31.7720 0.0891 4.1683 0.1569 13.9217 1.0533 9.1711 38.3657 67.3357 0.0056 2.0573 3.4054 80.9413 55.0027 0.3432 85.9448 33.1480 0.3214 50.0010 1.3000 9.8126 18.5643 19.4758 28.9729 7.8118 1.7923 35.1807 0.3309 1.1530 0.0508 11.9374 11.5955 25.3319 0.1436 18.4739 4.9414
temp: 298.150 k
press: 1.00000 atm
elementType: 8 7 7 7 7 6 6 6 6 6 6 6 6 6 6 6 6 1 1 1 1 1 1 1 1
symmnumber: 1
zpe: 467091.0 jmol-1
zpe.correction: 0.177906 hartree
zpe.thermalcorrener: 0.190055 hartree
zpe.thermalcorrenthalpy: 0.191000 hartree
zpe.thermalcorrgfe: 0.138739 hartree
zpe.sumelectzpe: -755.050729 hartree
zpe.sumelectthermal: -755.038579 hartree
zpe.sumelectthermalent: -755.037635 hartree
zpe.sumelectthermalfe: -755.089896 hartree
dipole: 3.2608 -9.2140 0.0030
dipole: 9.7740
quadrupole: -94.5811 -108.7812 -90.2380
quadrupole: 9.7911 0.0047 0.0205
quadrupole: 3.2857 -10.9144 7.6287 9.7911 0.0047 0.0205
hfenergy: -755.2286346 hartree
pointgroup: C01 [X(C12H8N4O1)]
dipole: -1.3147069 -3.6136439 -0.0004564 debye
dipolederiv: -0.2121077 -0.4628641 -0.0000309 0.2007554 -1.1556125 -0.000229 0.0001247 0.0000663 -0.1174154 -0.4381732 -0.3064565 0.0000129 0.1011377 -0.6060174 -0.00009 0.0000127 -0.0000828 0.0886921 -0.5834757 -0.1265255 0.0000093 0.1606946 -0.3951165 -0.0000768 0.0003417 0.000117 -0.2000085 -0.2959897 -0.1044955 -0.0000371 -0.0803189 -0.2503719 0.0000114 -0.0000589 -0.0000298 -0.2182598 0.2146279 -0.1974955 -0.0001658 -0.3634398 1.6477568 0.0003608 -0.0003808 0.0001214 -0.1611015 0.4835716 0.1865872 -0.0000269 -0.1244842 0.3451146 0.0002531 -0.00021 0.0000089 -0.0333352 0.1566432 0.0554485 0.0000897 0.1095161 -0.044433 -0.0001659 0.0003251 -0.000001 0.0498976 0.3030852 0.2855481 0.0000283 -0.145741 0.4719982 0.000006 -0.0001093 -0.0000676 0.0978622 0.1814412 0.6533369 0.0001037 0.2642643 -0.6515847 -0.0001099 0.0001323 -0.0001338 0.1218511 0.226349 -0.0654045 -0.0000101 -0.2384617 0.4077046 0.0001244 -0.0000363 0.0000365 -0.0559438 -0.1397522 0.0063249 -0.0821797 0.000121 -0.0975372 -0.0547255 0.057727 0.0049058 0.0423137 -0.1398444 0.0060773 0.0822594 0.0009017 -0.0974697 0.0541873 -0.0576658 -0.0053035 0.042366 -0.4011703 0.1915677 0.0000632 0.008439 0.0347193 0.0000068 0.000018 -0.0000022 -0.1222645 -0.049568 0.0299134 0.1137056 0.0247319 -0.1253266 0.0214673 0.0707057 0.0151731 0.0725198 -0.0498056 0.0302267 -0.1134221 0.0247213 -0.1253005 -0.022142 -0.0705706 -0.0159364 0.0725487 0.4635266 -0.0868906 -0.0000694 0.1815177 0.0562002 -0.0000317 -0.0001398 0.0001008 -0.0409875 0.0897063 0.0773159 0.0000607 0.0664875 -0.1213923 -0.0001846 0.0001507 -0.0001392 -0.0387259 0.0480925 -0.0588623 0.0000287 -0.0628885 0.074184 -0.0000204 -0.0000204 0.0000336 0.1458109 0.069256 -0.0237377 0.0842452 -0.0277736 0.1192293 0.0341577 0.0833191 0.0196366 -0.0180465 0.0690497 -0.0234744 -0.0844588 -0.0275598 0.1193898 -0.0335884 -0.0835342 -0.0192221 -0.0181565 0.1049097 -0.0011052 0.0000154 0.0106774 -0.0544562 -0.0000257 0.0000288 -0.0000196 0.1735628 0.0200401 -0.036161 -0.0755419 -0.0417063 0.140973 -0.0209968 -0.0939928 -0.0247567 -0.0544335 0.0202087 -0.0363693 0.075335 -0.0420532 0.1407894 0.0217144 0.0937923 0.0254436 -0.05446 -0.0390424 0.0841006 0.0000254 0.0820658 0.0333339 -0.0000204 0.0000778 -0.0000566 0.1344068 -0.1015784 -0.0766053 -0.0000399 -0.0816046 0.1332255 0.0001177 -0.0000369 0.000108 0.0913068 unknown
polarizability: 210.1003781|-10.7900043|189.4006392|0.0122426|-0.0513779|102.2750084 unknown
InChI: InChI=1S/C12H8N4O/c17-15-11-10(9-5-2-1-3-6-9)16-8-4-7-13-12(16)14-11/h1-8H
charge 0 multiplicity 1
25 atoms
O  0.442331 3.897707 0.000315
N  1.064556 -0.574584 -0.000079
N  2.022725 1.531759 -0.00018
N  3.527781 -0.400428 -0.000397
N  -0.19483 2.783954 0.000429
C  0.000978 0.321796 -0.000062
C  -1.419955 -0.099487 -0.000087
C  2.308909 0.21722 -0.000237
C  0.629573 1.600216 0.000149
C  1.10994 -1.961377 -0.000148
C  -2.104954 -0.309863 -1.225778
C  -2.103723 -0.314034 1.225574
C  2.357494 -2.565524 -0.000365
C  -3.453852 -0.727463 -1.223798
C  -3.452628 -0.731614 1.223525
C  3.544062 -1.745126 -0.000409
C  -4.129724 -0.941369 -0.000158
H  0.157687 -2.497738 -0.000113
H  -1.586293 -0.127183 -2.173421
H  -1.584135 -0.134545 2.173324
H  2.437178 -3.654354 -0.000506
H  -3.977456 -0.876667 -2.174085
H  -3.975291 -0.884023 2.173823
H  4.5327 -2.215965 -0.00064
H  -5.17767 -1.260305 -0.000173
