program: Gaussian 09
title: 000265818
version: EM64L-G09RevD.01
frameworkgroup: C1[X(C13H16O)]
method: RPBEPBE
basis: SDD
operation: Freq
keyword: #pfreq=noraman
keyword: PBEPBE/SDD
title: #p freq=noraman PBEPBE/SDD
converged: YES YES NO NO
title: Mulliken charges:
elementType: O C C C C C C C C C C C C C H H H H H H H H H H H H H H H H
charge: -0.275249 -0.428216 -0.515633 -0.408970 -0.440180 0.304210 -0.359964 0.357733 -0.520350 -0.407225 0.328493 -0.227185 -0.388395 -0.536981 0.204165 0.203678 0.210714 0.228534 0.206986 0.203370 0.210027 0.213487 0.208967 0.261557 0.225516 0.218421 0.240993 0.219210 0.219655 0.242632
chargesum: 0.00000
title: Mulliken charges with hydrogens summed into heavy atoms:
elementType: O C C C C C C C C C C C C C
charge: -0.275249 -0.020373 -0.076386 0.001387 -0.016666 0.304210 -0.150997 0.357733 -0.258793 -0.181709 0.328493 -0.008764 -0.147402 0.144516
polarizability: 2.19232119e+02 -1.01566003e+01 1.41745068e+02 3.37281993e+00 1.63656049e+00 8.27632763e+01
1716.lowfreq: -0.0005 -0.0004 0.0005 4.6722 6.3666 10.0609 41.0653 67.1168 100.1668
frequency: 40.7236 67.0359 100.1537 117.1338 163.0937 202.8445 230.2194 257.3507 263.1525 272.7876 303.2924 358.1853 418.3639 461.1310 472.4792 492.9736 521.2904 551.3239 609.9350 651.9222 691.7077 724.0667 780.4485 798.5600 807.8528 845.2190 861.6315 869.5975 891.2410 922.5885 932.7466 943.8770 963.4027 981.6067 994.3921 1029.1690 1077.3909 1078.6064 1095.1356 1106.2213 1111.5285 1132.5060 1152.4055 1172.8930 1175.9831 1194.8463 1240.3516 1256.3150 1278.7080 1295.1026 1311.4189 1338.0599 1341.1010 1347.5889 1366.6288 1389.9104 1424.3979 1438.5986 1453.2079 1461.1445 1465.8560 1470.1497 1474.8285 1476.3478 1483.5273 1578.9737 1615.9551 1657.3006 2942.0144 2951.8984 2956.3753 2977.2670 2977.7060 3001.0685 3015.1288 3037.3948 3042.4000 3046.8596 3104.2152 3121.9856 3127.2584 3153.6488 3164.4456 3168.8376
redmass: 3.2327 3.1631 3.2576 3.9689 2.2628 1.7575 2.6941 3.0073 1.8642 3.2115 2.1351 3.5063 2.6518 2.5314 4.0707 3.1613 4.2225 4.4270 3.5237 4.1510 1.8456 2.8716 1.5458 2.3751 1.8443 1.4982 2.6569 1.4667 1.6738 1.4263 2.4219 2.8028 1.3400 5.3984 4.4917 2.7300 1.8296 1.7644 1.6457 1.4180 1.2608 1.1692 1.4050 1.5544 1.4339 1.4978 1.2956 1.7264 1.7302 1.3422 1.2669 1.4041 1.6628 1.6450 1.8154 6.9410 2.2075 1.3710 1.1050 1.1022 1.0505 1.1022 1.0663 1.0990 2.3185 5.6532 6.5471 6.6329 1.0653 1.0644 1.0331 1.0624 1.0664 1.0894 1.0935 1.0989 1.1037 1.1042 1.0897 1.0990 1.0865 1.0920 1.0911 1.0963
irintensity: 0.0193 5.5302 3.1101 0.8627 1.1153 0.2281 2.2996 1.6865 0.3689 0.2225 1.5220 1.2447 3.6091 1.1574 1.8793 0.3812 0.7784 6.7943 2.4316 1.8816 22.4794 16.7973 56.9153 17.4671 5.1394 17.8607 4.3143 1.8974 17.5616 4.3537 4.1642 4.4841 0.4680 3.8450 34.1597 41.2392 0.6050 0.5040 9.1769 3.3580 0.2454 7.2737 4.9755 0.2922 84.5330 44.1481 3.5450 33.9571 18.9182 12.7427 2.5412 1.2415 1.6626 13.0376 19.7788 8.2919 31.8102 1.6424 1.6841 25.2830 12.5814 11.4833 23.6831 6.6697 42.8798 80.5380 112.9020 7.1644 45.3629 29.5309 72.7054 29.9190 29.7478 60.8204 26.4043 70.1206 51.1879 70.1452 26.0543 28.4154 6.8106 18.3334 9.1520 11.2074
temp: 298.150 k
press: 1.00000 atm
elementType: 8 6 6 6 6 6 6 6 6 6 6 6 6 6 1 1 1 1 1 1 1 1 1 1 1 1 1 1 1 1
symmnumber: 1
zpe: 668981.6 jmol-1
zpe.correction: 0.254802 hartree
zpe.thermalcorrener: 0.267683 hartree
zpe.thermalcorrenthalpy: 0.268628 hartree
zpe.thermalcorrgfe: 0.215305 hartree
zpe.sumelectzpe: -579.144939 hartree
zpe.sumelectthermal: -579.132058 hartree
zpe.sumelectthermalent: -579.131113 hartree
zpe.sumelectthermalfe: -579.184436 hartree
dipole: 0.6972 0.4356 0.0941
dipole: 0.8275
quadrupole: -63.8814 -80.6682 -87.8325
quadrupole: 0.7522 0.1170 0.3077
quadrupole: 13.5793 -3.2075 -10.3718 0.7522 0.1170 0.3077
hfenergy: -579.3997409 hartree
pointgroup: C01 [X(C13H16O1)]
dipole: 0.2759982 -0.1695228 -0.0329043 debye
polarizability: 219.0117341|10.8449005|142.0012437|-3.8084634|0.0527684|82.727486 unknown
InChI: InChI=1S/C13H16O/c1-14-13-9-5-8-12(10-13)11-6-3-2-4-7-11/h5-6,8-10H,2-4,7H2,1H3
charge 0 multiplicity 1
30 atoms
O  3.238792 1.455737 0.170612
C  -3.328281 1.411618 -0.673414
C  -1.820129 1.294079 -0.357739
C  -4.171253 0.673277 0.388477
C  -3.816873 -0.831462 0.395988
C  -1.390677 -0.135735 -0.023889
C  -2.322588 -1.078881 0.31431
C  0.070558 -0.447619 -0.055741
C  1.024476 0.594977 0.055497
C  0.55714 -1.782479 -0.20706
C  2.41354 0.32295 0.041222
C  1.938138 -2.045121 -0.221088
C  2.888669 -1.002722 -0.094272
C  4.685773 1.23819 0.165656
H  -3.61691 2.478713 -0.72815
H  -3.532216 0.969021 -1.669319
H  -1.572507 1.961189 0.495557
H  -1.227534 1.666436 -1.216225
H  -5.252573 0.810018 0.197522
H  -3.959006 1.106587 1.386201
H  -4.316927 -1.339383 -0.458004
H  -4.221154 -1.317438 1.306877
H  -1.99082 -2.094232 0.571801
H  0.716695 1.638037 0.171697
H  -0.147226 -2.60889 -0.343912
H  2.291283 -3.075363 -0.345584
H  3.958157 -1.230939 -0.112529
H  5.02376 0.787768 -0.788384
H  5.000534 0.593354 1.00972
H  5.128055 2.239014 0.279472
