program: Gaussian 09
title: 000265816
version: EM64L-G09RevD.01
frameworkgroup: C1[X(C13H15NO2)]
method: RPBEPBE
basis: SDD
operation: Freq
keyword: #p
keyword: freq=noraman
keyword: PBEPBE/SDD
title: #p freq=noraman PBEPBE/SDD
converged: YES YES NO NO
title: Mulliken charges:
elementType: O O N C C C C C C C C C C C C C H H H H H H H H H H H H H H H
charge: -0.231725 -0.243248 -0.463632 -0.346887 -0.444081 -0.422155 -0.508063 0.176459 0.154035 0.314614 0.263407 -0.348975 -0.384847 -0.833596 -0.236990 -0.248722 0.286994 0.242048 0.243891 0.232322 0.213063 0.247408 0.261658 0.382871 0.303067 0.227777 0.231614 0.246113 0.234256 0.225963 0.225364
chargesum: 0.00000
title: Mulliken charges with hydrogens summed into heavy atoms:
elementType: O O N C C C C C C C C C C C C C
charge: -0.231725 -0.243248 -0.080761 -0.059893 0.041858 0.023229 0.001002 0.176459 0.154035 0.314614 0.263407 -0.045909 -0.157070 -0.121613 -0.011027 -0.023358
polarizability: 2.21177776e+02 -1.76991965e+00 1.57315448e+02 3.97333809e+00 2.57302559e+00 8.49945706e+01
1716.lowfreq: -6.9728 -0.0006 0.0002 0.0004 5.3328 7.3278 30.9460 45.4824 67.9240
frequency: 30.6741 45.4742 67.9008 90.3800 101.1276 172.1792 183.7964 191.5268 201.4062 233.8448 279.4528 305.5699 324.8963 396.8069 423.8789 447.9548 505.7892 510.3335 540.8213 548.9292 576.9381 601.1986 619.2892 709.4962 728.6831 743.6105 767.3801 799.4706 815.4720 835.3816 848.7945 881.1931 889.0645 916.3166 930.9241 954.1140 980.3271 986.7179 994.9085 1020.1663 1041.6329 1048.2467 1070.3319 1110.2580 1132.7275 1158.3267 1159.8304 1173.5337 1183.3532 1197.3125 1205.6718 1214.3959 1257.1874 1273.0712 1277.0587 1297.5463 1304.8385 1318.5280 1376.5737 1402.2032 1423.9493 1439.4938 1466.2920 1476.8043 1479.2009 1484.2100 1488.4165 1544.3635 1596.4072 1607.9133 1619.1187 1647.7807 2951.2682 2966.3147 2982.6565 3006.7577 3027.8408 3038.3596 3073.2664 3081.8253 3088.5351 3103.0523 3121.8972 3136.6756 3159.3881 3192.2336 3348.6356
redmass: 3.6250 4.9985 4.1539 5.1355 4.0753 3.3600 1.1263 2.0374 4.5595 3.9589 3.5174 5.5715 4.3963 4.6969 3.5695 2.9658 3.3061 4.0041 3.9209 3.4556 5.9851 3.2107 3.9472 3.1880 2.7528 3.7697 1.3235 2.0457 2.7499 2.2460 2.2516 1.3028 1.6717 2.1384 2.8417 1.3701 1.8417 1.6108 1.3077 1.8890 1.5400 2.1012 1.9657 1.8079 1.9211 2.3512 1.9332 1.1042 1.9233 1.8398 2.1831 1.6326 1.3081 1.3949 2.1664 1.6755 1.3761 1.5117 6.0559 1.2702 1.0787 2.2013 1.7533 1.0814 1.0442 1.0954 1.5349 2.1933 6.1295 7.1866 6.7618 3.5399 1.0802 1.0392 1.0666 1.0647 1.0644 1.0973 1.0943 1.0999 1.0967 1.1028 1.0867 1.0904 1.0985 1.0949 1.0793
irintensity: 0.4987 3.2988 3.6056 3.3020 1.7293 2.8911 1.7045 1.8912 8.4718 0.9934 5.5892 10.5493 0.6241 2.2979 2.4237 7.6316 1.9178 7.3158 8.3672 3.0681 25.3523 3.2190 4.3346 2.3881 14.1508 8.3262 60.1146 25.4307 38.6188 1.7606 47.6920 2.7825 3.6669 13.4964 4.8613 4.1318 10.6317 2.2349 1.9838 4.8322 7.0949 18.7110 6.3693 1.8089 3.6747 70.4483 95.0940 0.4540 27.8101 8.8701 9.3554 51.2640 2.1535 2.8668 29.8067 37.2806 2.5751 3.2012 33.4627 15.0328 24.1315 25.2139 98.0420 15.4688 13.9253 3.1398 69.0484 417.0308 186.6050 29.9463 14.8863 170.6589 3.2792 22.2719 7.5194 43.4415 10.5700 17.0364 14.1590 27.4312 21.8239 24.7368 6.9959 21.7062 33.3355 6.5437 153.2790
temp: 298.150 k
press: 1.00000 atm
elementType: 8 8 7 6 6 6 6 6 6 6 6 6 6 6 6 6 1 1 1 1 1 1 1 1 1 1 1 1 1 1 1
symmnumber: 1
zpe: 663673.1 jmol-1
zpe.correction: 0.252780 hartree
zpe.thermalcorrener: 0.267362 hartree
zpe.thermalcorrenthalpy: 0.268306 hartree
zpe.thermalcorrgfe: 0.210291 hartree
zpe.sumelectzpe: -708.438256 hartree
zpe.sumelectthermal: -708.423674 hartree
zpe.sumelectthermalent: -708.422730 hartree
zpe.sumelectthermalfe: -708.480746 hartree
dipole: 2.8245 1.7145 0.4813
dipole: 3.3390
quadrupole: -74.9066 -101.1473 -94.6715
quadrupole: -1.9567 0.5763 1.1097
quadrupole: 15.3352 -10.9055 -4.4297 -1.9567 0.5763 1.1097
hfenergy: -708.6910362 hartree
pointgroup: C01 [X(C13H15N1O2)]
dipole: -1.0648957 0.5053354 0.5799349 debye
polarizability: 218.4918402|-18.514313|95.0630138|6.1465434|21.5203358|149.932941 unknown
InChI: InChI=1S/C13H15NO2/c1-9-5-2-3-7-11(9)14-13(16)10-6-4-8-12(10)15/h2-3,5,7,10,14H,4,6,8H2,1H3
charge 0 multiplicity 1
31 atoms
O  -1.566032 1.0536 1.766064
O  -0.50857 -0.13107 -2.256213
N  0.401241 0.602887 -0.203943
C  -1.969502 1.059432 -0.690299
C  -3.193853 0.535604 -1.478423
C  -4.39655 0.766641 -0.519107
C  -3.820642 0.478751 0.889307
C  -2.352356 0.883153 0.793465
C  -0.615834 0.434456 -1.127243
C  1.770634 0.215376 -0.305777
C  2.610839 0.477884 0.82387
C  2.300061 -0.398623 -1.471646
C  3.973187 0.109991 0.741236
C  2.063917 1.137154 2.079794
C  3.665276 -0.75106 -1.519461
C  4.509492 -0.500029 -0.415839
H  -1.863654 2.156427 -0.846353
H  -3.054266 -0.539319 -1.691825
H  -3.315541 1.042061 -2.448337
H  -5.256622 0.122449 -0.766286
H  -4.739205 1.816992 -0.57865
H  -3.852422 -0.607609 1.115308
H  -4.323586 0.994588 1.724739
H  0.093582 0.991191 0.702397
H  1.637441 -0.594432 -2.316499
H  4.623121 0.307129 1.602273
H  1.675409 2.155576 1.880274
H  1.236293 0.558509 2.534267
H  2.855199 1.232976 2.841316
H  4.064329 -1.225002 -2.423137
H  5.569213 -0.774783 -0.451566
