program: Gaussian 09
title: 000265821
version: EM64L-G09RevD.01
frameworkgroup: C1[X(C22H22O4)]
method: RPBEPBE
basis: SDD
operation: Freq
keyword: #pfreq=noraman
keyword: PBEPBE/SDD
title: #p freq=noraman PBEPBE/SDD
converged: YES YES NO NO
title: Mulliken charges:
elementType: O O O O C C C C C C C C C C C C C C C C C C C C C C H H H H H H H H H H H H H H H H H H H H H H
charge: -0.273609 -0.273594 -0.255782 -0.255789 -0.372762 -0.372703 -0.314922 -0.314981 0.224194 0.224250 -0.358291 -0.358344 0.476068 0.476066 -0.252469 -0.252466 -0.365645 -0.365643 -0.382533 -0.382533 -0.235775 -0.235776 -0.232632 -0.232633 -0.232305 -0.232303 0.204025 0.242529 0.242578 0.204017 0.234724 0.222869 0.222874 0.234729 0.248956 0.248958 0.259592 0.259593 0.231208 0.231209 0.237274 0.237275 0.230063 0.230064 0.231892 0.231892 0.233296 0.233296
chargesum: 0.00000
title: Mulliken charges with hydrogens summed into heavy atoms:
elementType: O O O O C C C C C C C C C C C C C C C C C C C C C C
charge: -0.273609 -0.273594 -0.255782 -0.255789 0.073792 0.073892 0.142671 0.142623 0.224194 0.224250 -0.109336 -0.109386 0.476068 0.476066 0.007123 0.007127 -0.134437 -0.134434 -0.145259 -0.145258 -0.005712 -0.005712 -0.000741 -0.000742 0.000991 0.000993
polarizability: 5.19504811e+02 -4.08193628e-02 2.37869905e+02 -5.32498772e+01 -3.56566788e-02 1.27716975e+02
1716.lowfreq: -0.0008 0.0004 0.0011 3.3417 3.8138 10.8683 11.0591 18.6932 21.5190
frequency: 10.8628 13.6959 21.5177 25.9820 31.0419 46.5068 46.5418 74.0291 86.6816 92.2405 93.5971 109.1519 116.8872 127.8021 150.6754 202.6869 206.7702 219.8775 223.1852 262.1622 279.7991 281.0548 288.3589 318.9113 362.7789 387.3406 402.9546 402.9638 457.8491 491.1042 491.4458 512.2934 534.1439 575.3346 584.4025 615.9512 616.0275 671.2797 671.8251 675.5703 676.8084 698.3602 698.4703 763.5486 775.0764 775.1310 801.3163 810.7704 819.7813 848.3832 848.3891 890.4149 890.5724 893.6683 899.6048 928.8839 928.8906 936.0991 964.7833 980.5551 980.5599 983.9257 988.8483 989.2621 997.5345 997.5424 1014.5178 1014.6021 1026.3157 1026.5593 1043.4061 1045.7936 1083.7761 1083.7927 1089.7196 1116.8502 1126.8613 1156.4090 1174.4942 1174.5101 1191.3776 1191.4646 1202.4586 1218.3330 1218.4386 1256.5573 1276.8503 1291.9542 1298.2462 1298.4449 1303.8908 1305.4723 1306.3059 1336.1752 1336.2685 1340.1472 1377.2814 1381.5580 1388.2059 1388.5852 1440.8157 1440.8516 1451.6792 1455.2038 1474.3920 1486.0516 1486.1890 1487.0633 1582.4765 1582.5065 1604.4610 1605.4756 1615.6651 1616.4526 1646.5182 1647.3827 2989.1024 2995.5436 3020.6337 3022.0413 3040.4792 3061.6946 3098.4428 3100.3063 3100.3436 3102.6826 3123.8702 3123.8744 3129.5360 3129.5386 3141.6797 3141.6855 3152.4876 3152.4962 3160.8149 3160.8395 3167.7381 3167.7642
redmass: 5.9931 6.2562 4.2298 6.8135 4.7224 5.6851 6.0883 5.2312 3.9103 4.9260 5.3065 3.4583 2.0182 3.4356 3.0668 4.1390 4.4770 4.7355 4.9856 5.3412 2.9677 3.1367 4.3393 4.0303 3.9738 5.3603 2.7533 2.7547 4.2601 2.8944 2.8540 5.1475 5.3859 6.3023 5.3023 6.4229 6.4062 4.9227 4.8067 4.2861 4.7984 1.6687 1.6741 1.0938 1.9590 1.9587 2.2555 5.3812 1.8899 1.2796 1.2796 1.9313 1.8198 4.5455 4.2953 1.4660 1.4661 1.4444 5.8920 1.3899 1.3898 4.8642 6.2021 6.1533 1.3121 1.3122 1.2063 1.2057 2.2104 2.2080 4.3900 3.7609 1.5931 1.5952 3.1708 3.4864 3.4007 1.8491 1.0666 1.0670 1.1281 1.1301 1.3110 1.6202 1.6287 1.2325 1.2077 1.0528 1.9576 1.8610 1.1589 1.6149 1.5885 1.2699 1.2735 1.3697 1.4734 1.4530 6.2110 4.6622 2.2856 2.2863 1.0995 1.1025 1.0739 2.1368 2.3153 1.1440 5.6884 5.6889 7.8480 7.5025 7.2572 7.5591 5.6965 5.7034 1.0597 1.0600 1.0580 1.0574 1.0996 1.1036 1.1086 1.0901 1.0901 1.1081 1.0868 1.0868 1.0868 1.0868 1.0916 1.0916 1.0964 1.0964 1.0914 1.0914 1.1015 1.1015
irintensity: 0.1808 1.1477 0.0191 0.0333 0.0796 2.4608 0.0175 0.4398 0.3897 0.0571 1.1343 0.4546 0.5534 0.9518 0.1556 1.7482 0.0091 0.9723 3.2160 2.0848 0.0805 2.8795 8.4886 43.9269 0.0007 6.4305 0.0448 0.0029 1.4934 27.4361 0.1369 0.7827 20.4977 0.1683 31.6615 0.0218 0.1063 0.5108 14.1397 5.3930 12.4288 0.6762 83.2418 6.7842 1.0815 132.2255 9.2227 8.1102 1.0573 0.0519 0.6940 21.8388 0.2650 18.6387 1.7633 0.0012 0.0255 0.1343 226.1018 0.1586 0.3871 14.9485 10.4015 3.2570 0.1113 12.1788 1.9907 82.7338 0.6717 1.6899 96.7232 3.8123 2.7148 24.3805 6.6946 1149.5070 134.4916 9.6884 5.6569 0.5899 28.6792 2.3137 6.9650 65.9091 3.3974 25.7294 19.4267 4.8612 59.7950 14.6828 1.8834 161.5229 40.7212 0.5658 39.4567 0.4201 0.0394 2.0324 4.4593 25.6213 22.5598 9.8691 39.1039 4.2829 0.1904 28.2750 2.2024 28.9734 8.0084 9.7071 312.8540 80.1084 128.5754 68.9944 288.0489 47.4787 5.7156 18.0921 2.3325 104.7610 0.6315 11.3440 3.8080 1.0615 1.3385 48.7946 7.4134 3.5307 0.8537 0.1765 12.2612 8.5350 12.7341 51.8992 7.0771 10.4068 61.6654 0.6570
temp: 298.150 k
press: 1.00000 atm
elementType: 8 8 8 8 6 6 6 6 6 6 6 6 6 6 6 6 6 6 6 6 6 6 6 6 6 6 1 1 1 1 1 1 1 1 1 1 1 1 1 1 1 1 1 1 1 1 1 1
symmnumber: 1
zpe: 1008110.2 jmol-1
zpe.correction: 0.383969 hartree
zpe.thermalcorrener: 0.408882 hartree
zpe.thermalcorrenthalpy: 0.409827 hartree
zpe.thermalcorrgfe: 0.322980 hartree
zpe.sumelectzpe: -1150.556009 hartree
zpe.sumelectthermal: -1150.531096 hartree
zpe.sumelectthermalent: -1150.530152 hartree
zpe.sumelectthermalfe: -1150.616998 hartree
dipole: 0.0000 -2.3964 0.0033
dipole: 2.3964
quadrupole: -79.6943 -143.8708 -158.5779
quadrupole: -0.0074 -9.7884 0.0005
quadrupole: 47.6867 -16.4898 -31.1969 -0.0074 -9.7884 0.0005
hfenergy: -1150.9399782 hartree
pointgroup: C01 [X(C22H22O4)]
dipole: 0.0001133 0.0018267 0.9428199 debye
polarizability: 517.689233|-59.5278217|129.5335423|0.1150072|0.3312821|237.8689157 unknown
InChI: InChI=1S/C22H22O4/c23-21(15-13-19-9-3-1-4-10-19)25-17-7-8-18-26-22(24)16-14-20-11-5-2-6-12-20/h1-6,9-16H,7-8,17-18H2
charge 0 multiplicity 1
48 atoms
O  -3.016281 -0.90936 1.147216
O  3.016933 0.916169 1.142305
O  -3.203778 -0.650588 -1.175912
O  3.203542 0.645534 -1.179528
C  -0.7611 0.140631 0.976195
C  0.761523 -0.134022 0.976517
C  -1.558971 -1.1718 0.986154
C  1.559651 1.178282 0.980318
C  -3.735618 -0.65253 -0.035174
C  3.735649 0.652392 -0.038929
C  -5.154676 -0.407813 0.286273
C  5.154862 0.409445 0.283177
C  -7.496013 0.116352 -0.5561
C  7.495718 -0.119666 -0.557471
C  -6.058512 -0.145081 -0.707123
C  6.058204 0.141271 -0.709216
C  -8.157091 0.132297 0.7076
C  8.157532 -0.128315 0.705915
C  -8.269377 0.366754 -1.726398
C  8.268311 -0.37727 -1.726712
C  -9.538539 0.389334 0.791918
C  9.538943 -0.385317 0.79095
C  -9.653503 0.623993 -1.642106
C  9.652391 -0.634505 -1.6417
C  -10.293981 0.636424 -0.381583
C  10.293604 -0.639661 -0.381501
H  -1.038618 0.735442 1.868478
H  -1.042458 0.726753 0.081324
H  1.042514 -0.724164 0.084187
H  1.039325 -0.724845 1.871363
H  -1.397597 -1.737694 0.050792
H  -1.303214 -1.794046 1.860234
H  1.30424 1.804584 1.85159
H  1.398264 1.739948 0.042406
H  -5.424018 -0.453389 1.345862
H  5.424681 0.460569 1.34239
H  -5.662002 -0.128639 -1.733363
H  5.661187 0.119291 -1.735157
H  -7.588326 -0.056833 1.62451
H  7.589376 0.066503 1.622013
H  -7.773321 0.357308 -2.704679
H  7.771679 -0.373495 -2.704738
H  -10.03247 0.398471 1.769833
H  10.033452 -0.388763 1.768609
H  -10.23077 0.813913 -2.553431
H  10.229057 -0.830074 -2.552212
H  -11.368905 0.836062 -0.311316
H  11.3685 -0.839254 -0.310675
