program: Gaussian 09
title: 000265871
version: EM64L-G09RevD.01
frameworkgroup: C1[X(C12H17ClN2O7S2)]
method: RPBEPBE
basis: SDD
operation: Freq
keyword: #p
keyword: freq=noraman
keyword: PBEPBE/SDD
title: #p freq=noraman PBEPBE/SDD
converged: NO YES NO NO
title: Mulliken charges:
elementType: Cl S S O O O O O O O N N C C C C C C C C C C C C H H H H H H H H H H H H H H H H H
charge: -0.005457 1.045187 1.044768 -0.407570 -0.406035 -0.488156 -0.525988 -0.487038 -0.526515 -0.246956 -0.150002 0.014712 -0.420937 -0.410792 0.449717 -0.273148 -0.277127 -0.330137 -0.337738 -0.305298 -0.314246 0.203889 -0.727047 -0.726682 0.256066 0.262572 0.250369 0.262557 0.247803 0.225663 0.246342 0.228428 0.295344 0.268379 0.277416 0.299021 0.289785 0.307226 0.295379 0.291336 0.304908
chargesum: 0.00000
title: Mulliken charges with hydrogens summed into heavy atoms:
elementType: Cl S S O O O O O O O N N C C C C C C C C C C C C
charge: -0.005457 1.045187 1.044768 -0.407570 -0.406035 -0.488156 -0.525988 -0.487038 -0.526515 -0.246956 -0.150002 0.014712 0.097702 0.102133 0.449717 0.200318 0.197643 -0.034793 -0.069359 -0.305298 -0.036830 0.203889 0.168985 0.164941
polarizability: 2.62046895e+02 -1.95271914e+01 3.26597000e+02 -1.36496965e+01 -1.83724628e+01 1.91329996e+02
1716.lowfreq: -7.6579 -4.5820 -0.0002 0.0014 0.0018 4.9006 9.3024 19.9930 24.4384
frequency: 8.6647 19.8504 24.2749 28.5116 33.2748 38.1394 52.0289 69.3453 81.5681 86.4254 120.6580 125.7422 142.7252 148.6050 157.0480 162.5671 176.7979 177.9838 185.1165 200.7006 208.9686 225.5147 234.6448 245.2737 252.7003 267.9774 292.6997 300.4106 319.5386 340.1123 341.0538 366.7240 388.6570 392.8513 405.7798 419.7775 432.6724 457.3723 464.5810 487.1512 531.0720 572.2783 592.5477 592.8665 602.4438 621.1215 654.6849 717.6766 727.6198 791.6010 814.4969 819.4062 827.7005 834.5629 835.8797 846.8782 884.8096 903.1413 915.2363 915.7417 970.2969 980.0765 991.8050 998.8784 998.9847 1009.1917 1012.2093 1040.7803 1041.2350 1065.0898 1102.7180 1113.1089 1152.2606 1183.1633 1225.0197 1243.5796 1245.0815 1260.9925 1265.5828 1303.4977 1320.5808 1321.8203 1338.0547 1348.8831 1357.5730 1363.0030 1368.4230 1398.8483 1410.1136 1412.2967 1415.7090 1416.4322 1441.6794 1442.8264 1453.4514 1474.1586 1477.3391 1502.5577 1521.7140 1612.5668 2979.0456 2981.7040 3002.7120 3008.4679 3035.9459 3036.2949 3052.7073 3053.9456 3094.6408 3101.2365 3132.7351 3179.2367 3186.5982 3187.9448 3189.3478 3192.0779 3192.6092
redmass: 8.0006 7.8847 6.3436 8.0464 7.7746 9.2875 8.1656 6.1726 5.9687 6.4230 4.0020 4.6258 1.1592 1.2862 9.6613 6.1371 3.9968 7.2797 3.7308 5.0641 4.4244 4.6607 4.3736 3.8434 4.8534 5.6778 4.2677 6.6892 5.9154 9.5342 9.6426 4.2344 5.2700 4.5246 6.2284 3.0747 3.8780 3.5064 4.5977 3.1883 5.4261 2.7148 8.5080 8.9080 4.2165 4.7673 6.4592 3.6518 5.0084 3.5578 2.1185 3.1102 2.5829 9.4912 5.2478 1.6054 3.6036 2.1945 2.9880 2.9783 2.6805 1.3280 1.5406 1.4447 2.5614 2.9542 2.5935 1.9203 1.9259 2.6240 2.7753 2.0319 2.6372 1.9137 1.3357 1.1785 1.1687 1.5757 1.3447 4.2228 1.1309 1.1335 1.2567 1.2661 1.3368 1.2888 2.8153 1.9816 1.0534 1.0526 1.0518 1.0522 1.0793 1.0832 3.1947 1.2156 1.1490 3.4843 7.6798 6.6914 1.0597 1.0595 1.0689 1.0688 1.0246 1.0246 1.1029 1.1031 1.0950 1.0944 1.0891 1.0931 1.1080 1.1079 1.0916 1.1078 1.1081
irintensity: 3.9924 1.0285 0.1674 1.6438 7.8516 2.8680 0.8389 8.2503 1.4496 3.3737 0.7352 1.9438 0.6726 0.3276 0.4529 1.7757 15.9499 4.6950 0.4512 0.2627 2.9746 0.1118 1.4844 11.9438 2.3840 0.1686 0.6377 7.1316 9.6186 10.3127 30.9471 15.6032 6.4536 11.6901 7.5609 3.6568 17.9716 2.4810 90.5349 9.7420 4.2542 42.9557 24.9793 29.3076 8.5799 3.4690 8.9408 4.1920 29.1667 8.4297 6.1285 38.7772 69.9942 50.7452 60.9508 55.7909 38.7679 4.9677 74.5872 16.2576 86.4507 3.3044 0.6084 27.4837 3.5534 34.8241 131.0117 141.7875 30.8819 8.2955 76.9297 140.2216 49.9291 218.0437 40.7924 16.1737 7.5819 36.1660 25.3432 257.4649 2.5108 4.8653 3.1873 12.0610 11.1146 2.9659 8.1928 15.4284 7.0691 5.3385 15.1253 17.9070 12.8565 8.9512 20.1627 39.9444 14.9707 104.1967 67.0530 365.5537 19.8850 22.9847 19.6406 45.6851 1.9590 2.3705 18.1101 16.6606 5.4644 2.5120 0.7560 6.9180 0.4606 0.5839 0.7556 5.5909 3.2678
temp: 298.150 k
press: 1.00000 atm
elementType: 17 16 16 8 8 8 8 8 8 8 7 7 6 6 6 6 6 6 6 6 6 6 6 6 1 1 1 1 1 1 1 1 1 1 1 1 1 1 1 1 1
symmnumber: 1
zpe: 760197.4 jmol-1
zpe.correction: 0.289544 hartree
zpe.thermalcorrener: 0.317467 hartree
zpe.thermalcorrenthalpy: 0.318411 hartree
zpe.thermalcorrgfe: 0.226680 hartree
zpe.sumelectzpe: -2357.445705 hartree
zpe.sumelectthermal: -2357.417782 hartree
zpe.sumelectthermalent: -2357.416838 hartree
zpe.sumelectthermalfe: -2357.508569 hartree
dipole: 0.8250 -3.5340 0.0587
dipole: 3.6295
quadrupole: -178.8577 -199.8047 -166.5836
quadrupole: 4.1279 -2.6297 3.3693
quadrupole: 2.8910 -18.0560 15.1651 4.1279 -2.6297 3.3693
hfenergy: -2357.7352494 hartree
pointgroup: C01 [X(C12H17Cl1N2O7S2)]
dipole: 0.1447685 -1.4201639 0.0349657 debye
polarizability: 253.948905|-12.798969|329.8720593|-22.4472155|-17.8145161|196.1529271 unknown
InChI: InChI=1S/C12H17ClN2O7S2/c1-23(17,18)21-7-5-15(6-8-22-24(2,19)20)10-3-4-12(14-16)11(13)9-10/h3-4,9H,5-8H2,1-2H3
charge 0 multiplicity 1
41 atoms
Cl -1.445689 3.394567 2.026519
S  -3.78844 -1.495751 0.060501
S  3.905842 -1.23767 0.060748
O  -2.589824 -1.387241 1.523738
O  2.701808 -1.478158 -1.389389
O  -5.106661 -2.332791 0.466043
O  -2.917105 -1.962296 -1.229208
O  5.328011 -1.929795 -0.256328
O  3.099688 -1.648798 1.411368
O  0.172234 4.977374 -1.697888
N  0.046717 -1.179613 0.02075
N  -0.288159 4.495737 -0.5870
C  -0.158105 -1.830024 1.32977
C  0.313772 -2.082404 -1.115857
C  -0.030396 0.199381 -0.140809
C  -1.560003 -2.444117 1.523063
C  1.765634 -2.599571 -1.185355
C  -0.601876 1.033932 0.879937
C  0.459857 0.843446 -1.336016
C  -0.670656 2.418048 0.701225
C  0.372191 2.225126 -1.485103
C  -0.192921 3.061609 -0.473656
C  -4.164727 0.361909 0.03332
C  4.030473 0.642686 -0.136818
H  0.589093 -2.640139 1.439214
H  0.065084 -1.115164 2.136384
H  -0.356356 -2.960229 -1.033063
H  0.029848 -1.587227 -2.05627
H  -1.62284 -2.956125 2.500939
H  -1.769648 -3.184374 0.724876
H  1.88796 -3.288249 -2.041655
H  2.022166 -3.144105 -0.254226
H  -1.0428 0.594983 1.776291
H  0.950606 0.251495 -2.111329
H  0.749695 2.727895 -2.384057
H  -4.556771 0.596613 1.031802
H  -4.910602 0.506564 -0.760441
H  -3.210278 0.864433 -0.168607
H  4.432484 0.805786 -1.145629
H  4.715035 0.985168 0.651543
H  3.009651 1.02989 -0.026226
