program: Gaussian 09
title: 000265760
version: EM64L-G09RevD.01
frameworkgroup: C1[X(C4H7N7O2)]
method: RPBEPBE
basis: SDD
operation: Freq
keyword: #pfreq=noraman
keyword: PBEPBE/SDD
title: #p freq=noraman PBEPBE/SDD
converged: YES YES NO NO
title: Mulliken charges:
elementType: O O N N N N N N N C C C C H H H H H H H
charge: -0.268912 -0.301286 -0.428793 0.086385 -0.072199 -0.381920 -0.367998 -0.490153 -0.493221 -0.131371 0.281679 0.066710 0.201400 0.340170 0.325193 0.382434 0.314995 0.316144 0.298544 0.322197
chargesum: 0.00000
title: Mulliken charges with hydrogens summed into heavy atoms:
elementType: O O N N N N N N N C C C C
charge: -0.268912 -0.301286 -0.088623 0.086385 -0.072199 -0.056727 0.014437 0.140986 0.127520 -0.131371 0.281679 0.066710 0.201400
polarizability: 1.94670411e+02 -2.17772131e+01 1.08738861e+02 -3.54593340e-01 -1.24058483e+00 4.74271816e+01
1716.lowfreq: -9.7902 -5.4053 -0.0006 -0.0005 -0.0004 3.0465 36.4997 65.2432 121.9066
frequency: 36.4582 65.2374 121.8790 137.8314 144.1667 168.8770 206.6015 213.4688 236.2021 287.0261 326.3194 340.6187 383.9656 433.8582 463.7749 473.4722 547.4645 549.2484 642.1093 656.1667 667.2390 694.5629 726.9671 775.7763 788.5900 802.9542 823.8072 857.7538 973.7882 1056.5113 1086.7187 1162.7339 1196.9497 1242.5843 1274.2505 1282.0055 1298.6369 1306.9555 1389.3511 1467.7597 1478.6021 1514.5101 1552.4911 1578.6634 1594.4472 1652.2349 1689.2330 3243.6951 3379.6992 3398.4619 3512.6296 3522.7245 3547.1074 3561.9866
redmass: 6.4681 6.7262 1.1438 4.2130 3.8058 5.6138 5.6015 3.2179 1.6096 7.1017 5.1207 4.2047 7.2165 12.2510 1.1520 6.2514 8.8869 7.7225 1.8224 9.2909 2.9392 6.7894 4.3296 4.3244 1.6612 2.0755 1.5955 2.2090 7.4664 4.9464 9.2716 4.6906 3.4769 4.5053 4.4035 1.3064 1.1513 2.1453 2.7708 2.5176 1.7020 3.2656 5.7161 3.3394 3.4890 1.2533 1.0608 1.0886 1.0434 1.0433 1.0990 1.0988 1.0790 1.0790
irintensity: 0.3961 10.2840 12.0076 3.9267 2.3248 4.3135 0.5982 34.8181 83.0123 9.2803 8.8301 48.2365 9.7369 7.5582 137.2823 3.5864 7.1756 3.4681 126.1524 6.8766 60.3698 1.9886 100.8538 58.8608 456.8461 66.4615 134.0653 97.4366 8.1782 32.2543 1.9811 4.0813 36.4387 120.7158 18.3798 20.8354 0.6251 78.3382 79.3179 365.9451 86.0673 61.4782 145.1442 279.1476 257.8868 23.0801 32.2328 207.7998 28.9184 2.0409 5.7960 13.1893 42.0008 107.4330
temp: 298.150 k
press: 1.00000 atm
elementType: 8 8 7 7 7 7 7 7 7 6 6 6 6 1 1 1 1 1 1 1
symmnumber: 1
zpe: 374055.1 jmol-1
zpe.correction: 0.142470 hartree
zpe.thermalcorrener: 0.155093 hartree
zpe.thermalcorrenthalpy: 0.156038 hartree
zpe.thermalcorrgfe: 0.103152 hartree
zpe.sumelectzpe: -689.286021 hartree
zpe.sumelectthermal: -689.273398 hartree
zpe.sumelectthermalent: -689.272454 hartree
zpe.sumelectthermalfe: -689.325340 hartree
dipole: -4.8834 1.4697 1.3728
dipole: 5.2813
quadrupole: -61.7619 -81.2712 -73.7067
quadrupole: -14.7464 5.7903 -1.5618
quadrupole: 10.4847 -9.0246 -1.4601 -14.7464 5.7903 -1.5618
hfenergy: -689.4284914 hartree
pointgroup: C01 [X(C4H7N7O2)]
dipole: -1.9036852 0.8252954 0.110296 debye
dipolederiv: -0.8197447 0.154995 -0.1029668 0.292153 -0.8256987 0.2311103 -0.1769089 0.2229305 -0.5053867 -0.6559336 -0.3623873 0.1805606 -0.1779459 -0.7098403 0.1980553 0.1169716 0.1976496 -0.4869834 -1.2996669 0.2368759 -0.1583312 -0.5560606 -0.3516886 0.0342761 0.2385485 0.0448875 -0.2423103 0.6466648 -0.3378973 0.1872261 0.2671355 -0.1608477 0.0120381 -0.1184019 -0.0040702 -0.1350907 -1.2423044 0.3771861 -0.2311378 0.3511522 -0.5739535 0.1440424 -0.2307158 0.1500934 -0.400229 -1.3141082 0.0762356 -0.0735666 0.2988183 -0.0769282 -0.1733116 -0.1710693 -0.1925901 -0.4090448 0.3778019 -0.2790677 0.0811055 -0.3413861 -0.3931594 0.1571503 0.0649914 0.2283498 -0.5397534 -0.4993225 0.0850782 -0.0688399 0.2267896 -0.0935918 0.0349526 -0.1365787 0.0253867 -0.0681421 -1.0079634 0.3900875 -0.1240037 0.5383079 -0.6204519 0.0054171 0.1960248 -0.1487698 -0.0847939 0.2838783 -0.2835322 0.1208911 -0.2672017 -0.1582716 0.1293392 0.1062849 0.1494317 0.0347233 2.01973 -0.186732 0.1837926 -0.0285059 0.7281502 -0.210138 0.1330326 -0.2115963 0.3980918 1.1360629 -0.3089968 0.2098218 -0.2951823 0.919626 -0.3306011 0.2008538 -0.3289956 0.4624867 0.4262488 0.3575592 -0.1207409 0.3489777 0.821417 -0.4440925 -0.3393497 -0.3671726 0.3835711 0.1220099 0.0113301 -0.0135898 -0.0470361 0.2469007 0.0410363 0.0116475 0.0466182 0.3218884 0.2246286 -0.0755506 0.0250333 -0.1464681 0.126611 0.1015486 0.0494007 0.1076117 0.3167241 0.4983304 0.0816401 -0.0200048 0.1484958 0.2788391 0.0375056 0.1015564 -0.0636611 0.380149 0.3357455 -0.0134637 -0.126418 -0.1437083 0.1441432 0.0431301 -0.0592937 0.0258757 0.0800284 0.2993993 0.1013843 0.1099982 -0.0281971 0.07844 -0.0318089 0.1641046 0.0032304 0.1804605 0.2132992 -0.0286572 -0.0105449 -0.3554749 0.4512167 -0.0977434 -0.0651561 0.0245817 0.0597465 0.255244 0.0039126 -0.0482847 -0.084663 0.1690878 0.1180935 -0.0859429 0.0902087 0.2538645 unknown
polarizability: 191.6192027|-21.5058462|97.1703263|16.5344503|-26.8354142|62.0469239 unknown
InChI: InChI=1S/C4H7N7O2/c5-8-3(13)1-2(12)7-4(9-6)11-10-1/h8-9,11H,5-6H2
charge 0 multiplicity 1
20 atoms
O  0.330138 -1.624432 1.20541
O  2.794611 1.53686 -0.368618
N  -1.366919 1.652561 -0.418749
N  0.014639 1.654304 -0.372771
N  -1.608287 -0.516668 0.546456
N  -3.519104 0.687477 -0.110252
N  2.681675 -0.457284 0.822233
N  -4.401261 -0.340448 0.302494
N  4.085962 -0.604577 0.764468
C  0.591916 0.56414 0.146465
C  -2.147479 0.584302 0.017542
C  -0.215044 -0.601569 0.671184
C  2.099079 0.613948 0.172899
H  -1.757239 2.50787 -0.816414
H  -3.963964 1.507518 -0.522658
H  2.083763 -1.254937 1.118617
H  -4.316844 -0.501073 1.316527
H  -4.203584 -1.211362 -0.21093
H  4.50425 -0.644976 1.702613
H  4.464593 0.160945 0.183984
