program: Gaussian 09
title: 000265777
version: EM64L-G09RevD.01
frameworkgroup: C1[X(C10H16N5OP)]
method: RPBEPBE
basis: SDD
operation: Freq
keyword: #p
keyword: freq=noraman
keyword: PBEPBE/SDD
title: #p freq=noraman PBEPBE/SDD
converged: YES YES NO NO
title: Mulliken charges:
elementType: P O N N N N N C C C C C C C C C C H H H H H H H H H H H H H H H H
charge: 1.280101 -0.580436 -0.495345 -0.448524 -0.735307 -0.050745 -0.079136 0.003164 -0.020407 -0.478090 -0.437238 -0.705697 -0.702580 0.127603 -0.272823 -0.255472 -0.171040 0.267303 0.263842 0.242692 0.282253 0.234690 0.279773 0.213522 0.224866 0.231847 0.228577 0.227803 0.213344 0.376276 0.249175 0.247978 0.238027
chargesum: 0.00000
title: Mulliken charges with hydrogens summed into heavy atoms:
elementType: P O N N N N N C C C C C C C C C C
charge: 1.280101 -0.580436 -0.495345 -0.448524 -0.359031 -0.050745 -0.079136 0.270468 0.243435 0.046855 0.077225 -0.035461 -0.032856 0.127603 -0.023648 -0.007493 0.066987
polarizability: 2.22772123e+02 -2.03110853e+00 1.54796818e+02 -2.43667504e+00 1.11073028e+01 1.32677854e+02
1716.lowfreq: -8.4062 -0.0016 -0.0016 -0.0013 3.4058 9.1897 32.0516 37.0645 50.2802
frequency: 31.9505 36.8798 50.2307 59.5603 64.8059 95.5952 117.9215 136.3780 156.6478 177.4783 188.8162 205.8468 223.7460 253.2026 259.4534 286.1499 325.0867 342.7832 390.7830 405.4995 416.5900 428.9730 475.7714 521.2802 542.3649 584.8189 619.3449 636.2996 648.2087 741.8655 757.0980 761.7139 790.0059 807.0692 839.9653 841.6418 881.0273 893.4993 897.2727 954.0327 958.6913 972.2589 974.3252 988.4427 1019.0375 1027.4929 1035.3179 1056.2622 1072.7997 1074.7481 1079.1734 1118.5684 1122.0490 1136.1418 1139.7115 1166.5409 1169.1131 1188.3585 1249.9316 1251.6457 1268.5285 1321.2997 1368.6928 1375.8915 1379.9183 1396.3879 1400.2976 1411.2507 1454.7557 1456.3200 1463.1068 1464.6438 1473.9614 1475.2079 1477.4419 1521.7718 1556.7665 2984.4932 2985.6133 3074.0813 3076.8482 3079.1746 3079.8201 3083.6575 3084.9561 3103.8605 3105.8396 3138.8307 3140.5146 3186.8474 3189.8100 3189.9678 3545.7105
redmass: 3.3325 3.3723 4.0472 4.9814 4.8811 3.1222 4.6923 5.2121 3.3644 4.7190 1.3024 1.1549 3.1454 4.5082 4.0900 5.8864 4.0737 4.1524 2.4705 4.1820 2.6787 3.4654 6.5832 2.7632 4.6261 6.3507 5.1539 7.7981 1.4512 4.2172 4.5044 3.8719 1.9067 2.4996 3.8152 3.8849 4.9850 1.2171 1.2614 7.2363 1.3832 2.4131 1.4508 2.5580 1.8834 1.2922 2.5564 2.5329 1.4010 1.4174 1.6770 1.3031 1.3750 1.3948 1.4457 1.8593 1.8404 1.7922 1.7163 1.7248 3.7687 1.4690 1.7041 1.5303 1.3666 1.4803 1.5862 1.7900 1.2563 1.0967 1.1529 1.1321 1.0676 1.0519 2.9774 5.4544 5.3955 1.0358 1.0358 1.0541 1.0987 1.0970 1.0547 1.0937 1.0932 1.0966 1.0950 1.0902 1.0932 1.1179 1.1167 1.1005 1.0761
irintensity: 1.6369 1.2985 0.9352 0.2690 3.4687 0.5072 1.2706 0.9031 6.9898 5.1230 2.3527 0.7289 16.3081 8.0860 2.6770 0.8289 3.7353 2.4317 10.9940 0.1253 1.2013 5.6798 76.2013 14.9449 67.8603 37.1323 2.1330 67.9138 70.0154 4.3256 65.0653 25.7360 9.1013 50.7043 65.3585 188.4733 33.7341 15.2894 6.6479 37.0236 0.4070 71.0532 1.3607 41.2007 31.7633 76.9034 47.7842 0.5179 14.5516 7.9245 6.5009 5.3361 8.1653 9.7583 12.5269 13.5614 3.9073 22.7562 30.8197 28.6706 13.0677 20.4201 2.4764 11.9295 10.1457 28.8066 53.3941 5.8395 108.4321 20.2881 70.4460 8.8116 4.8165 2.3542 523.2014 78.4139 371.5756 24.4965 32.1552 22.5672 22.5844 16.6550 31.5336 14.2376 3.1857 22.1415 30.6362 17.8894 19.5822 6.0358 8.2787 12.2872 73.5141
temp: 298.150 k
press: 1.00000 atm
elementType: 15 8 7 7 7 7 7 6 6 6 6 6 6 6 6 6 6 1 1 1 1 1 1 1 1 1 1 1 1 1 1 1 1
symmnumber: 1
zpe: 681659.3 jmol-1
zpe.correction: 0.259630 hartree
zpe.thermalcorrener: 0.277686 hartree
zpe.thermalcorrenthalpy: 0.278630 hartree
zpe.thermalcorrgfe: 0.212341 hartree
zpe.sumelectzpe: -1079.487038 hartree
zpe.sumelectthermal: -1079.468983 hartree
zpe.sumelectthermalent: -1079.468039 hartree
zpe.sumelectthermalfe: -1079.534328 hartree
dipole: -1.1098 1.9423 -2.3357
dipole: 3.2342
quadrupole: -83.5317 -101.8354 -117.0625
quadrupole: -4.3743 -2.4953 3.5822
quadrupole: 17.2782 -1.0255 -16.2527 -4.3743 -2.4953 3.5822
hfenergy: -1079.7466688 hartree
pointgroup: C01 [X(C10H16N5O1P1)]
dipole: 0.4884148 -0.7256952 -0.9240419 debye
polarizability: 221.4507075|-4.122086|156.3484703|9.7554298|-10.1932605|132.4476166 unknown
InChI: InChI=1S/C10H16N5OP/c1-8-6-14(8)17(16,15-7-9(15)2)13-10-11-4-3-5-12-10/h3-5,8-9,13H,6-7H2,1-2H3
charge 0 multiplicity 1
33 atoms
P  -0.94814 0.34906 0.678449
O  -0.92043 0.759655 2.223775
N  -2.154518 1.169008 -0.358989
N  -1.334272 -1.35273 0.379762
N  0.437833 0.882968 -0.307067
N  2.705235 1.362126 -0.699785
N  2.017318 -0.361206 0.908186
C  -3.619346 1.044653 0.024069
C  -0.468825 -2.314288 -0.409108
C  -2.892421 2.354628 0.258515
C  -0.599462 -2.460219 1.100192
C  -4.584332 0.838901 -1.125431
C  -1.196085 -3.212034 -1.389335
C  1.763112 0.62326 -0.021077
C  4.003829 1.097601 -0.386235
C  3.328114 -0.575343 1.206672
C  4.377853 0.140399 0.586591
H  -3.824972 0.454099 0.928015
H  0.495687 -1.913263 -0.749751
H  -3.042312 3.189743 -0.433326
H  -2.633802 2.618364 1.291992
H  -1.255935 -3.229889 1.519988
H  0.265959 -2.171271 1.707543
H  -5.610081 1.125162 -0.827149
H  -4.287637 1.449202 -1.995828
H  -4.593889 -0.221223 -1.435592
H  -2.153874 -3.557024 -0.9635
H  -1.412593 -2.671896 -2.328708
H  -0.579603 -4.097444 -1.632833
H  0.242111 1.543748 -1.064444
H  4.754208 1.679355 -0.93315
H  3.530156 -1.347952 1.956809
H  5.424213 -0.045351 0.837749
