program: Gaussian 09
title: 000265788
version: EM64L-G09RevD.01
frameworkgroup: C1[X(C18H22O2)]
method: RPBEPBE
basis: SDD
operation: Freq
keyword: #pfreq=noraman
keyword: PBEPBE/SDD
title: #p freq=noraman PBEPBE/SDD
converged: NO YES NO NO
title: Mulliken charges:
elementType: O O C C C C C C C C C C C C C C C C C C H H H H H H H H H H H H H H H H H H H H H H
charge: -0.278165 -0.243277 -0.088431 -0.090497 -0.256889 -0.190043 -0.540498 -0.061522 -0.543343 -0.513373 -0.516852 -0.419571 0.285807 -0.665970 0.454275 -0.407656 -0.373399 -0.224588 -0.219783 -0.242650 0.260331 0.226738 0.278631 0.239594 0.231260 0.228427 0.274941 0.235355 0.227742 0.230763 0.208832 0.210302 0.221094 0.201771 0.214111 0.232827 0.241746 0.234651 0.255364 0.226284 0.226809 0.228855
chargesum: 0.00000
title: Mulliken charges with hydrogens summed into heavy atoms:
elementType: O O C C C C C C C C C C C C C C C C C C
charge: -0.278165 -0.243277 0.171899 0.136241 0.021742 0.049551 -0.080811 0.213419 -0.080247 -0.073779 -0.085456 -0.003689 0.285807 -0.191397 0.454275 -0.173005 -0.118035 0.001697 0.007025 -0.013795
polarizability: 1.82088405e+02 1.53309468e+01 1.95408260e+02 1.42734735e+01 -4.20009362e+00 1.65566441e+02
1716.lowfreq: -13.0451 -7.1024 -0.0005 0.0007 0.0008 2.0695 6.3539 21.6833 29.5634
frequency: -7.8973 21.3617 29.3601 43.4176 68.1053 97.8715 157.6554 159.3711 199.0808 220.8017 269.2236 282.5169 309.8299 335.2698 363.0658 385.4939 402.7847 460.8043 472.1906 497.9993 515.6067 526.0285 540.9900 615.1100 629.3741 660.9683 693.5084 708.3222 725.2906 750.5437 762.4291 788.2748 802.0781 826.2718 849.4546 852.8964 855.3594 873.1002 892.3107 907.1209 910.5293 925.1431 930.9986 938.7068 951.1436 958.2577 975.5466 978.6580 989.7829 995.8462 996.4320 1009.5307 1022.0866 1026.9712 1039.2271 1054.1422 1066.6936 1076.3748 1091.9022 1108.5998 1117.7381 1128.2815 1157.8475 1161.7866 1172.5413 1173.8960 1189.1778 1191.4461 1202.4729 1205.1940 1226.1313 1230.6010 1258.4279 1268.9340 1273.7707 1278.6232 1281.0930 1285.5822 1288.8281 1294.5826 1305.3804 1314.6144 1326.2768 1329.8608 1331.2537 1341.1171 1383.0838 1440.7178 1454.6833 1464.2003 1469.5492 1472.7449 1477.3251 1483.0222 1493.0538 1594.2123 1609.8954 1630.9401 2974.6760 2984.7328 2987.2552 3000.3132 3009.3578 3010.2804 3026.9896 3030.3595 3039.0738 3047.0233 3052.8579 3056.7589 3065.8221 3075.2397 3078.4661 3084.9654 3098.7684 3120.6499 3125.9124 3137.5529 3147.5925 3163.7548
redmass: 4.9589 4.0310 3.6931 6.0519 3.5991 5.5780 3.7313 3.1025 3.1286 4.8564 3.4191 4.6024 2.1143 2.3802 3.0866 2.5836 2.8289 2.5953 2.6538 3.9629 4.0442 4.4570 2.1221 6.1229 4.8504 2.3469 4.1450 1.8839 2.5500 3.7055 2.6255 3.2796 2.7428 3.8209 2.4816 2.0187 1.2522 3.6184 1.6262 2.4235 2.7377 1.6096 2.0486 2.0067 1.8843 1.8838 2.7351 1.3922 5.8022 1.7302 1.3911 1.9437 1.6377 2.2319 1.7327 1.3656 2.0805 1.7000 1.6047 1.6086 1.4671 1.6908 1.3932 1.5323 1.0565 1.5671 1.1445 1.8038 2.6133 1.5469 1.5100 1.7438 1.4791 1.3744 1.3753 1.4100 1.4780 1.3402 1.3636 1.3714 1.3653 1.4443 1.4538 1.4715 1.3670 1.4062 8.1165 2.1222 1.1244 1.0877 1.0853 1.0886 1.0992 2.2002 1.0909 6.1851 6.2164 9.7553 1.0641 1.0609 1.0659 1.0853 1.0610 1.0621 1.0594 1.0869 1.0864 1.0979 1.0992 1.0894 1.1028 1.1033 1.1034 1.0912 1.1033 1.0852 1.0875 1.0923 1.0966 1.1017
irintensity: 0.1400 0.2829 0.0196 0.8828 0.3815 2.2357 2.9069 0.4353 0.5333 5.2933 0.9684 0.7410 0.1350 0.8321 2.8874 2.3514 0.0412 0.2690 5.8776 8.4491 2.1796 7.2884 1.1368 0.9930 15.5691 1.0667 2.3782 50.1553 23.9821 9.8424 24.1058 5.0796 2.7909 3.5925 6.7293 0.9122 0.3537 12.4678 0.3309 4.1174 5.5721 3.2536 3.6644 5.2866 6.9425 5.0076 63.1039 0.1756 1.8211 5.4592 1.0469 26.1917 6.5958 5.8321 14.1619 9.3606 10.6818 28.3366 7.0883 182.7819 8.0599 0.3890 1.1317 0.3302 0.6571 4.9820 2.0630 2.1324 0.9146 2.4459 20.5885 164.5118 2.7157 2.5906 1.5259 0.2398 41.1304 4.5268 0.5931 8.3613 3.1319 1.9191 1.2582 2.9530 5.9863 6.8307 1.2119 8.3223 17.2290 4.0564 10.8829 9.1598 9.5183 18.0538 18.1864 4.8543 27.3583 150.6985 32.4708 29.9989 33.1230 18.5411 36.9999 24.1070 16.1126 14.8635 13.7930 43.8590 48.3261 61.6131 62.3244 40.5350 42.0979 11.3527 6.1367 3.5789 0.1042 16.2285 33.5477 19.1895
temp: 298.150 k
press: 1.00000 atm
elementType: 8 8 6 6 6 6 6 6 6 6 6 6 6 6 6 6 6 6 6 6 1 1 1 1 1 1 1 1 1 1 1 1 1 1 1 1 1 1 1 1 1 1
symmnumber: 1
zpe: 940415.0 jmol-1
zpe.correction: 0.358185 hartree
zpe.thermalcorrener: 0.374248 hartree
zpe.thermalcorrenthalpy: 0.375193 hartree
zpe.thermalcorrgfe: 0.313054 hartree
zpe.sumelectzpe: -848.085298 hartree
zpe.sumelectthermal: -848.069235 hartree
zpe.sumelectthermalent: -848.068291 hartree
zpe.sumelectthermalfe: -848.130429 hartree
dipole: -0.8564 1.2041 -1.3586
dipole: 2.0072
quadrupole: -114.5337 -117.7938 -117.5258
quadrupole: 4.9072 -0.6600 4.0306
quadrupole: 2.0841 -1.1760 -0.9081 4.9072 -0.6600 4.0306
hfenergy: -848.4434835 hartree
pointgroup: C01 [X(C18H22O2)]
dipole: -0.3412321 0.5062496 -0.5009019 debye
polarizability: 184.1950291|14.9743414|194.7551374|14.0464662|-4.0091016|164.112939 unknown
InChI: InChI=1S/C18H22O2/c19-18(9-12-5-2-1-3-6-12)20-17-11-13-10-16(17)15-8-4-7-14(13)15/h1-3,5-6,13-17H,4,7-11H2
charge 0 multiplicity 1
42 atoms
O  -0.262417 -1.742958 -0.739964
O  0.855253 -2.647475 1.101718
C  -1.449228 0.71444 0.294683
C  -2.679981 0.878062 -0.69511
C  -1.748095 -0.635941 1.014493
C  -3.513779 -0.412086 -0.429954
C  -3.3047 -0.628334 1.100814
C  -1.559209 -1.807287 0.007311
C  -2.728852 -1.628775 -1.010571
C  -1.468649 1.972242 1.21059
C  -3.357423 2.223387 -0.306784
C  -2.23464 3.039994 0.385727
C  0.874343 -2.170322 -0.057043
C  2.127832 -1.940086 -0.898016
C  2.758258 -0.584918 -0.567806
C  2.731376 0.474436 -1.508161
C  3.365698 -0.368498 0.696018
C  3.309476 1.727056 -1.196888
C  3.941721 0.882556 1.008616
C  3.91732 1.934469 0.062498
H  -0.492817 0.662957 -0.254012
H  -2.345737 0.91242 -1.749197
H  -1.19763 -0.780869 1.956827
H  -4.559481 -0.349459 -0.774783
H  -3.697313 0.191867 1.725537
H  -3.729062 -1.581263 1.467416
H  -1.58042 -2.776635 0.535891
H  -3.358802 -2.534914 -1.052011
H  -2.337617 -1.437414 -2.025028
H  -0.452386 2.297823 1.495518
H  -2.022123 1.76059 2.147054
H  -4.18371 2.045445 0.410723
H  -3.790888 2.744918 -1.179391
H  -1.562185 3.477426 -0.378253
H  -2.622046 3.870194 1.004345
H  1.863053 -1.990586 -1.966273
H  2.832905 -2.756136 -0.662052
H  2.258833 0.318065 -2.485351
H  3.376751 -1.179537 1.433696
H  3.28609 2.536526 -1.935299
H  4.40952 1.037068 1.987547
H  4.366964 2.904048 0.304431
